BDBM294494 1-[2-(2-{4,7-Dimethyl-[1,2,4]triazolo[1,5-a]pyrazin-2-yl}ethynyl)-1-methyl-1H-imidazol-4-yl]pyrrolidin-2-one::US9586970, 15
SMILES Cc1cnc(C)c2nc(nn12)C#Cc1nc(cn1C)N1CCCC1=O
InChI Key InChIKey=CKDRPPMIFRXUHG-UHFFFAOYSA-N
Data  1 IC50
  Tab Delimited (TSV)   2D SDfile   Computed 3D by Vconf -m prep SDfile
Find this compound or compounds like it in BindingDB:
Activity Spreadsheet -- Enzyme Inhibition Constant Data from BindingDB
Found 1 hit for monomerid = 294494
TargetcAMP and cAMP-inhibited cGMP 3',5'-cyclic phosphodiesterase 10A(Homo sapiens (Human))
Hoffmann-La Roche
US Patent
LigandPNGBDBM294494(1-[2-(2-{4,7-Dimethyl-[1,2,4]triazolo[1,5-a]pyrazi...)
Affinity DataIC50:  29nMT: 2°C. Assay description: The human PDE10A full length assay was performed in 96-well micro titer plates. The reaction mixture of 50 μl contained 20 mM HEPES pH=7.5/10 mM...
Ligand InfoPC cidPC sid
In DepthDetails US Patent