BDBM297743 US10118918, Compound 22::US9732072, Compound 22
SMILES CN1CCOc2cccc(OCC(=O)NC[C@@H](O)CN3Cc4ccccc4C3)c12
InChI Key InChIKey=NZSKHNAWILNXPF-GOSISDBHSA-N
Data  2 IC50
  Tab Delimited (TSV)   2D SDfile   Computed 3D by Vconf -m prep SDfile
Find this compound or compounds like it in BindingDB:
Activity Spreadsheet -- Enzyme Inhibition Constant Data from BindingDB
Found 2 hits for monomerid = 297743
TargetProtein arginine N-methyltransferase 5(Homo sapiens (Human))
Epizyme
US Patent
LigandPNGBDBM297743(US10118918, Compound 22 | US9732072, Compound 22)
Affinity DataIC50:  550nM. Assay description: General Materials.S-adenosylmethionine (SAM), S-adenosylhomocysteine (SAH), bicine, KCl, Tween20, dimethylsulfoxide (DMSO), bovine skin gelatin (BSG)...
Ligand InfoPC cidPC sid
In DepthDetails US Patent
TargetProtein arginine N-methyltransferase 5(Homo sapiens (Human))
Epizyme
US Patent
LigandPNGBDBM297743(US10118918, Compound 22 | US9732072, Compound 22)
Affinity DataIC50:  550nM. Assay description: The assays were all performed in a buffer consisting of 20 mM Bicine (pH=7.6), 1 mM TCEP, 0.005% BSG, and 0.002% Tween20, prepared on the day of use....
Ligand InfoPC cidPC sid
In DepthDetails US Patent