BDBM300482 3-({[1-(4-methylpiperazin-1-yl)cyclopropyl]carbonyl}amino)-N-(5-phenyl-1,3,4-thiadiazol-2-yl)-4-(trifluoromethoxy)benzamide::US10130633, Example 52
SMILES CN1CCN(CC1)C1(CC1)C(=O)Nc1cc(ccc1OC(F)(F)F)C(=O)Nc1nnc(s1)-c1ccccc1
InChI Key InChIKey=DZVKVGUMYHRZEX-UHFFFAOYSA-N
Data  2 IC50
  Tab Delimited (TSV)   2D SDfile   Computed 3D by Vconf -m prep SDfile
Find this compound or compounds like it in BindingDB:
Activity Spreadsheet -- Enzyme Inhibition Constant Data from BindingDB
Found 2 hits for monomerid = 300482
TargetProtein Wnt-3a(Homo sapiens (Human))
Bayer Pharma Aktiengesellschaft
US Patent
LigandPNGBDBM300482(3-({[1-(4-methylpiperazin-1-yl)cyclopropyl]carbony...)
Affinity DataIC50: >5.00E+4nM. Assay description: In preparation of the assay, the two cell lines were plated 24 hours before at 10000 cells per well of a 384 micro titre plate (MTP) in 30 μL gr...
Ligand InfoPC cidPC sid
In DepthDetails US Patent
TargetProtein Wnt-3a(Homo sapiens (Human))
Bayer Pharma Aktiengesellschaft
US Patent
LigandPNGBDBM300482(3-({[1-(4-methylpiperazin-1-yl)cyclopropyl]carbony...)
Affinity DataIC50:  26.5nM. Assay description: In preparation of the assay, the two cell lines were plated 24 hours before at 10000 cells per well of a 384 micro titre plate (MTP) in 30 μL gr...
Ligand InfoPC cidPC sid
In DepthDetails US Patent