BDBM300791 US10131645, Compound 3001
SMILES CNC(=O)c1c(oc2cc(N(CC3CC3)S(C)(=O)=O)c(cc12)-c1cccc(c1)C(=O)NC(C)(C#N)C1CC1)-c1ccc(F)cc1
InChI Key InChIKey=VNXCBZMXQLFMTK-UHFFFAOYSA-N
Data  1 EC50
  Tab Delimited (TSV)   2D SDfile   Computed 3D by Vconf -m prep SDfile
Find this compound or compounds like it in BindingDB:
Activity Spreadsheet -- Enzyme Inhibition Constant Data from BindingDB
Found 1 hit for monomerid = 300791
TargetGenome polyprotein(Hepatitis C virus (HCV))
Bristol-Myers Squibb
US Patent
LigandPNGBDBM300791(US10131645, Compound 3001)
Affinity DataEC50: <100nM. Assay description: To evaluate compound efficacy, titrated compounds were transferred to sterile 384-well tissue culture treated plates, and the plates were seeded with...
Ligand InfoPC cidPC sid
In DepthDetails US Patent