BDBM300795 US10131645, Compound 5001
SMILES CNC(=O)c1c(oc2cc(N(CCCF)S(C)(=O)=O)c(cc12)-c1cccc(c1)C(=O)NC(C1CC1)C(F)(F)F)-c1ccc(F)cc1
InChI Key InChIKey=MZBFWSCFXDEPJU-UHFFFAOYSA-N
Data  1 EC50
  Tab Delimited (TSV)   2D SDfile   Computed 3D by Vconf -m prep SDfile
Find this compound or compounds like it in BindingDB:
Activity Spreadsheet -- Enzyme Inhibition Constant Data from BindingDB
Found 1 hit for monomerid = 300795
TargetGenome polyprotein(Hepatitis C virus (HCV))
Bristol-Myers Squibb
US Patent
LigandPNGBDBM300795(US10131645, Compound 5001)
Affinity DataEC50:  22.9nM. Assay description: To evaluate compound efficacy, titrated compounds were transferred to sterile 384-well tissue culture treated plates, and the plates were seeded with...
Ligand InfoPC cidPC sid
In DepthDetails US Patent