BDBM300802 US10131645, Compound 7001
SMILES CCN(C(=O)C(F)(F)F)c1cc2oc(c(C(=O)NC)c2cc1-c1cccc(c1)C(=O)NC(C(=O)OC)C(F)(F)F)-c1ccc(F)cc1
InChI Key InChIKey=AGHYRLYQEQONBO-UHFFFAOYSA-N
Data  1 EC50
  Tab Delimited (TSV)   2D SDfile   Computed 3D by Vconf -m prep SDfile
Find this compound or compounds like it in BindingDB:
Activity Spreadsheet -- Enzyme Inhibition Constant Data from BindingDB
Found 1 hit for monomerid = 300802
TargetGenome polyprotein(Hepatitis C virus (HCV))
Bristol-Myers Squibb
US Patent
LigandPNGBDBM300802(US10131645, Compound 7001)
Affinity DataEC50:  550nM. Assay description: To evaluate compound efficacy, titrated compounds were transferred to sterile 384-well tissue culture treated plates, and the plates were seeded with...
Ligand InfoPC cidPC sid
In DepthDetails US Patent