BDBM301710 US9597310, 1::[(S)-6-Hydroxy-2,3-dihydro-benzofuran-3-yl]-acetic acid methyl ester
SMILES COCCOc1ccc(Oc2ccc(F)c3[C@@H](CCc23)Oc2ccc3[C@H](CC(O)=O)COc3c2)cc1
InChI Key InChIKey=UGXLGZFNBUIAEA-CRICUBBOSA-N
Data  1 EC50
  Tab Delimited (TSV)   2D SDfile   Computed 3D by Vconf -m prep SDfile
Find this compound or compounds like it in BindingDB:
Activity Spreadsheet -- Enzyme Inhibition Constant Data from BindingDB
Found 1 hit for monomerid = 301710
TargetFree fatty acid receptor 1(Homo sapiens (Human))
Boehringer Ingelheim International
US Patent
LigandPNGBDBM301710(US9597310, 1 | [(S)-6-Hydroxy-2,3-dihydro-benzofur...)
Affinity DataEC50:  7nM. Assay description: IP1 accumulation measurements using the IPOne assay system 1321N1 cells stably expressing human GPR40 receptor (Euroscreen, Belgium) are seeded 24 h ...
Ligand InfoPC cidPC sid
In DepthDetails US Patent