BDBM301715 US9597310, 5::{(S)-6-[(R)-7-Fluoro-4-hydroxy-indan-1-yloxy]-2,3-dihydro-benzofuran-3-yl}-acetic acid methyl ester
SMILES OC(=O)C[C@@H]1COc2cc(O[C@@H]3CCc4c3c(F)ccc4Oc3ccc(CN4CCOCC4)cc3)ccc12
InChI Key InChIKey=UMQPWNWMMXEYGW-NFQMXDRXSA-N
Data  1 EC50
  Tab Delimited (TSV)   2D SDfile   Computed 3D by Vconf -m prep SDfile
Find this compound or compounds like it in BindingDB:
Activity Spreadsheet -- Enzyme Inhibition Constant Data from BindingDB
Found 1 hit for monomerid = 301715
TargetFree fatty acid receptor 1(Homo sapiens (Human))
Boehringer Ingelheim International
US Patent
LigandPNGBDBM301715(US9597310, 5 | {(S)-6-[(R)-7-Fluoro-4-hydroxy-inda...)
Affinity DataEC50:  25nM. Assay description: IP1 accumulation measurements using the IPOne assay system 1321N1 cells stably expressing human GPR40 receptor (Euroscreen, Belgium) are seeded 24 h ...
Ligand InfoPC cidPC sid
In DepthDetails US Patent