BDBM301749 US9597310, 39::[(S)-6-((R)-4-{2,5-Difluoro-4-[3-(methylsulfonyl)propoxy]phenoxy}-7-fluoro-indan-1-yloxy)-2,3-dihydrobenzofuran-3-yl]-acetic acid
SMILES CS(=O)(=O)CCCOc1cc(F)c(Oc2ccc(F)c3[C@@H](CCc23)Oc2ccc3[C@H](CC(O)=O)COc3c2)cc1F
InChI Key InChIKey=BGNHUBCSSZOYCN-VOIUYBSRSA-N
Data  1 EC50
  Tab Delimited (TSV)   2D SDfile   Computed 3D by Vconf -m prep SDfile
Find this compound or compounds like it in BindingDB:
Activity Spreadsheet -- Enzyme Inhibition Constant Data from BindingDB
Found 1 hit for monomerid = 301749
TargetFree fatty acid receptor 1(Homo sapiens (Human))
Boehringer Ingelheim International
US Patent
LigandPNGBDBM301749(US9597310, 39 | [(S)-6-((R)-4-{2,5-Difluoro-4-[3-(...)
Affinity DataEC50:  23nM. Assay description: IP1 accumulation measurements using the IPOne assay system 1321N1 cells stably expressing human GPR40 receptor (Euroscreen, Belgium) are seeded 24 h ...
Ligand InfoPC cidPC sid
In DepthDetails US Patent