BDBM301796 N-[6-(2-Benzyloxy-ethoxy)-H-indazol-3-yl]-4-morpholin-4-yl-benzamide::US9597317, 24
SMILES O=C(Nc1n[nH]c2cc(OCCOCc3ccccc3)ccc12)c1cccc(c1)N1CCOCC1
InChI Key InChIKey=AKSDRERQQHIUIJ-UHFFFAOYSA-N
Data  2 IC50
  Tab Delimited (TSV)   2D SDfile   Computed 3D by Vconf -m prep SDfile
Find this compound or compounds like it in BindingDB:
Activity Spreadsheet -- Enzyme Inhibition Constant Data from BindingDB
Found 2 hits for monomerid = 301796
TargetMast/stem cell growth factor receptor Kit(Homo sapiens (Human))
Nerviano Medical Sciences
US Patent
LigandPNGBDBM301796(N-[6-(2-Benzyloxy-ethoxy)-H-indazol-3-yl]-4-morpho...)
Affinity DataIC50:  260nM. Assay description: i. Enzyme The assay has been performed using KIT cytoplasmic domain product and purified in house as GST fused protein. The KIT protein (4.5 microM) ...
Ligand InfoPC cidPC sid
In DepthDetails US Patent
TargetReceptor-type tyrosine-protein kinase FLT3(Homo sapiens (Human))
Nerviano Medical Sciences
US Patent
LigandPNGBDBM301796(N-[6-(2-Benzyloxy-ethoxy)-H-indazol-3-yl]-4-morpho...)
Affinity DataIC50:  162nM. Assay description: i. Enzyme The assay was performed using FLT3 cytoplasmic domain product and purified in house as GST fused protein. The FLT3 protein (1 microM) was p...
Ligand InfoPC cidPC sid
In DepthDetails US Patent