BDBM301880 2-Amino-N4-(cyclopropylmethyl)-N8-(5-ethoxy-3-pyridyl)-N4-propyl-3H-1-benzazepine-4,8-dicarboxamide::US9597333, 79
SMILES CCCN(CC1CC1)C(=O)C1=Cc2ccc(cc2N=C(N)C1)C(=O)Nc1cncc(OCC)c1
InChI Key InChIKey=WQIDOVAVXQLMHF-UHFFFAOYSA-N
Data  2 EC50
  Tab Delimited (TSV)   2D SDfile   Computed 3D by Vconf -m prep SDfile
Find this compound or compounds like it in BindingDB:
Activity Spreadsheet -- Enzyme Inhibition Constant Data from BindingDB
Found 2 hits for monomerid = 301880
TargetToll-like receptor 7(Homo sapiens (Human))
Hoffmann-La Roche
US Patent
LigandPNGBDBM301880(2-Amino-N4-(cyclopropylmethyl)-N8-(5-ethoxy-3-pyri...)
Affinity DataEC50:  3.10E+4nM. Assay description: For TLR8 and TLR7 activity testing, HEK-Blue human TLR8 or TLR7 cells (Invivogen, San Diego, Calif., USA) are used, respectively. These cells are des...
Ligand InfoPC cidPC sid
In DepthDetails US Patent
TargetToll-like receptor 8(Homo sapiens (Human))
Hoffmann-La Roche
US Patent
LigandPNGBDBM301880(2-Amino-N4-(cyclopropylmethyl)-N8-(5-ethoxy-3-pyri...)
Affinity DataEC50:  2nM. Assay description: For TLR8 and TLR7 activity testing, HEK-Blue human TLR8 or TLR7 cells (Invivogen, San Diego, Calif., USA) are used, respectively. These cells are des...
Ligand InfoPC cidPC sid
In DepthDetails US Patent