BDBM307526 (S)-2-(N-(4-((2-amino-4-(1-hydroxyhexan-3-ylamino)-6-methylpyrimidin-5-yl)methyl)-3-methoxybenzyl)acetamido)acetic acid::US10150743, Example 7::US10562861, Ex. No. 7
SMILES CCC[C@@H](CCO)Nc1nc(N)nc(C)c1Cc1ccc(CN(CC(O)=O)C(C)=O)cc1OC
InChI Key InChIKey=FIMNMHMOKYVGGK-IBGZPJMESA-N
Data  1 IC50  4 EC50
  Tab Delimited (TSV)   2D SDfile   Computed 3D by Vconf -m prep SDfile
Find this compound or compounds like it in BindingDB:
Activity Spreadsheet -- Enzyme Inhibition Constant Data from BindingDB
Found 5 hits for monomerid = 307526
TargetToll-like receptor 7(Homo sapiens (Human))
Sumitomo Dainippon Pharma
US Patent
LigandPNGBDBM307526((S)-2-(N-(4-((2-amino-4-(1-hydroxyhexan-3-ylamino)...)
Affinity DataEC50:  6.60E+3nM. Assay description: Recombinant human TLR7 was stably expressed in a HEK293 cell line already stably expressing the pNiFty2-SEAP reporter plasmid; integration of the rep...
Ligand InfoPC cidPC sid
In DepthDetails US Patent
TargetToll-like receptor 8(Homo sapiens (Human))
Sumitomo Dainippon Pharma
US Patent
LigandPNGBDBM307526((S)-2-(N-(4-((2-amino-4-(1-hydroxyhexan-3-ylamino)...)
Affinity DataEC50: <1.00E+4nM. Assay description: TLR8/NF-kB/SEAPorter HEK 293 Cell Line (Imgenex Corporation) is a stably co-transfected cell line which expresses full-length human TLR8 and the secr...
Ligand InfoPC cidPC sid
In DepthDetails US Patent
TargetPotassium voltage-gated channel subfamily H member 2(Homo sapiens (Human))
Sumitomo Dainippon Pharma
US Patent
LigandPNGBDBM307526((S)-2-(N-(4-((2-amino-4-(1-hydroxyhexan-3-ylamino)...)
Affinity DataIC50: >1.00E+4nM. Assay description: The hERG potassium current was measured in a hERG-stably-expressing Chinese hamster ovary K1 (CHO) cells. The experiments were performed using an aut...
Ligand InfoPC cidPC sid
In DepthDetails US Patent
TargetToll-like receptor 8(Homo sapiens (Human))
Sumitomo Dainippon Pharma
US Patent
LigandPNGBDBM307526((S)-2-(N-(4-((2-amino-4-(1-hydroxyhexan-3-ylamino)...)
Affinity DataEC50: >1.00E+4nM. Assay description: TLR8/NF-kB/SEAPorter™ HEK 293 Cell Line (Imgenex Corporation) is a stably co-transfected cell line which expresses full-length human TLR8 and the sec...
Ligand InfoPC cidPC sid
In DepthDetails US Patent
TargetToll-like receptor 7(Homo sapiens (Human))
Sumitomo Dainippon Pharma
US Patent
LigandPNGBDBM307526((S)-2-(N-(4-((2-amino-4-(1-hydroxyhexan-3-ylamino)...)
Affinity DataEC50:  251nM. Assay description: Recombinant human TLR7 was stably expressed in a HEK293 cell line already stably expressing the pNiFty2-SEAP reporter plasmid; integration of the rep...
Ligand InfoPC cidPC sid
In DepthDetails US Patent