BDBM311402 US10155764, Example 1
SMILES CN(C)C(CNc1nn(C)c(=O)c2cccnc12)c1ccccc1
InChI Key InChIKey=VWVIDIAXUYVRQR-UHFFFAOYSA-N
Data  1 IC50
  Tab Delimited (TSV)   2D SDfile   Computed 3D by Vconf -m prep SDfile
Find this compound or compounds like it in BindingDB:
Activity Spreadsheet -- Enzyme Inhibition Constant Data from BindingDB
Found 1 hit for monomerid = 311402
TargetHistone acetyltransferase KAT2B [719-832](Homo sapiens (Human))
Genentech
US Patent
LigandPNGBDBM311402(US10155764, Example 1)
Affinity DataIC50:  86nM. Assay description: His/Flag epitope tagged PCAF719-832 bromodomain was cloned, expressed and purified to homogeneity in-house. PCAF bromodomain binding and inhibition o...
Ligand InfoPC cidPC sid
In DepthDetails US Patent