BDBM311409 US10155764, Example 6
SMILES CN(C)CCNc1nn(C)c(=O)c2c(F)cccc12
InChI Key InChIKey=CBXQYKWWBRCFJR-UHFFFAOYSA-N
Data  1 IC50
  Tab Delimited (TSV)   2D SDfile   Computed 3D by Vconf -m prep SDfile
Find this compound or compounds like it in BindingDB:
Activity Spreadsheet -- Enzyme Inhibition Constant Data from BindingDB
Found 1 hit for monomerid = 311409
TargetHistone acetyltransferase KAT2B [719-832](Homo sapiens (Human))
Genentech
US Patent
LigandPNGBDBM311409(US10155764, Example 6)
Affinity DataIC50:  87nM. Assay description: His/Flag epitope tagged PCAF719-832 bromodomain was cloned, expressed and purified to homogeneity in-house. PCAF bromodomain binding and inhibition o...
Ligand InfoPC cidPC sid
In DepthDetails US Patent