BDBM31158 3-hydroxyquinolin-2(1H)-one, 12
SMILES Cc1ccc2cc(O)c(=O)[nH]c2c1
InChI Key InChIKey=BAUHXXRSZJRUOO-UHFFFAOYSA-N
Data  2 IC50
  Tab Delimited (TSV)   2D SDfile   Computed 3D by Vconf -m prep SDfile
Find this compound or compounds like it in BindingDB:
Activity Spreadsheet -- Enzyme Inhibition Constant Data from BindingDB
Found 2 hits for monomerid = 31158
TargetD-aspartate oxidase(Homo sapiens (Human))
Pfizer
LigandPNGBDBM31158(3-hydroxyquinolin-2(1H)-one, 12)
Affinity DataIC50:  2.15E+4nM. Assay description: Inhibitory effect of compounds was determined in a cell free fluorescence assay. The H2O2 generated from the degradation of D-aspartic acid was linke...
In DepthDetails ArticlePubMed
TargetD-amino-acid oxidase(Homo sapiens (Human))
Pfizer
LigandPNGBDBM31158(3-hydroxyquinolin-2(1H)-one, 12)
Affinity DataIC50:  197nMpH: 8.5 T: 2°C. Assay description: Inhibitory effect of compounds was determined in a cell free fluorescence assay. The H2O2 generated from the degradation of D-serine was linked to ox...
In DepthDetails ArticlePubMed