BDBM311773 7-Methyl-5-[7-methyl-2-(trifluoromethyl)imidazo[1,2-a]pyridin-8-yl]indolin-2-one::US10155769, Example 11
SMILES Cc1cc(cc2CC(=O)Nc12)-c1c(C)ccn2nc(nc12)C(F)(F)F
InChI Key InChIKey=WLXVNELQXCSMBW-UHFFFAOYSA-N
Data  1 IC50
  Tab Delimited (TSV)   2D SDfile   Computed 3D by Vconf -m prep SDfile
Find this compound or compounds like it in BindingDB:
Activity Spreadsheet -- Enzyme Inhibition Constant Data from BindingDB
Found 1 hit for monomerid = 311773
TargetVoltage-dependent calcium channel gamma-2 subunit(Homo sapiens (Human))
Janssen Pharmaceutica
US Patent
LigandPNGBDBM311773(7-Methyl-5-[7-methyl-2-(trifluoromethyl)imidazo[1,...)
Affinity DataIC50:  1nM. Assay description: An in vitro assay was used to determine the potency of test compounds as inhibitors of the glutamate response of the channel formed by GluA1o-γ8...
Ligand InfoPC cidPC sid
In DepthDetails US Patent