BDBM311796 8-(7-Chloro-1H-indazol-5-yl)-2-ethyl-7-(trifluoromethyl)-[1,2,4]triazolo[1,5-a]pyridine::US10155769, Example 34
SMILES CCc1nc2c(-c3cc(Cl)c4[nH]ncc4c3)c(ccn2n1)C(F)(F)F
InChI Key InChIKey=FGKWSXDBUIWSIM-UHFFFAOYSA-N
Data  1 IC50
  Tab Delimited (TSV)   2D SDfile   Computed 3D by Vconf -m prep SDfile
Find this compound or compounds like it in BindingDB:
Activity Spreadsheet -- Enzyme Inhibition Constant Data from BindingDB
Found 1 hit for monomerid = 311796
TargetVoltage-dependent calcium channel gamma-2 subunit(Homo sapiens (Human))
Janssen Pharmaceutica
US Patent
LigandPNGBDBM311796(8-(7-Chloro-1H-indazol-5-yl)-2-ethyl-7-(trifluorom...)
Affinity DataIC50:  0.398nM. Assay description: An in vitro assay was used to determine the potency of test compounds as inhibitors of the glutamate response of the channel formed by GluA1o-γ8...
Ligand InfoPC cidPC sid
In DepthDetails US Patent