BDBM311805 7-(4-Fluorophenyl)-8-(7-chloro-1H-indazol-5-yl)-2-(trifluoromethyl)-[1,2,4]triazolo[1,5-a]pyridine::US10155769, Example 43
SMILES Fc1ccc(cc1)-c1ccn2nc(nc2c1-c1cc(Cl)c2[nH]ncc2c1)C(F)(F)F
InChI Key InChIKey=KCMXFZIZHXFNFH-UHFFFAOYSA-N
Data  1 IC50
  Tab Delimited (TSV)   2D SDfile   Computed 3D by Vconf -m prep SDfile
Find this compound or compounds like it in BindingDB:
Activity Spreadsheet -- Enzyme Inhibition Constant Data from BindingDB
Found 1 hit for monomerid = 311805
TargetVoltage-dependent calcium channel gamma-2 subunit(Homo sapiens (Human))
Janssen Pharmaceutica
US Patent
LigandPNGBDBM311805(7-(4-Fluorophenyl)-8-(7-chloro-1H-indazol-5-yl)-2-...)
Affinity DataIC50:  0.0100nM. Assay description: An in vitro assay was used to determine the potency of test compounds as inhibitors of the glutamate response of the channel formed by GluA1o-γ8...
Ligand InfoPC cidPC sid
In DepthDetails US Patent