BDBM311850 2-Cyclopropyl-8-(7-methyl-1H-indazol-5-yl)-7-(trifluoromethyl)imidazo[1,2-a]pyridine::US10155769, Example 91
SMILES Cc1cc(cc2cn[nH]c12)-c1c(ccn2cc(nc12)C1CC1)C(F)(F)F
InChI Key InChIKey=JDOFYDBGQSJBAV-UHFFFAOYSA-N
Data  1 IC50
  Tab Delimited (TSV)   2D SDfile   Computed 3D by Vconf -m prep SDfile
Find this compound or compounds like it in BindingDB:
Activity Spreadsheet -- Enzyme Inhibition Constant Data from BindingDB
Found 1 hit for monomerid = 311850
TargetVoltage-dependent calcium channel gamma-2 subunit(Homo sapiens (Human))
Janssen Pharmaceutica
US Patent
LigandPNGBDBM311850(2-Cyclopropyl-8-(7-methyl-1H-indazol-5-yl)-7-(trif...)
Affinity DataIC50:  0.251nM. Assay description: An in vitro assay was used to determine the potency of test compounds as inhibitors of the glutamate response of the channel formed by GluA1o-γ8...
Ligand InfoPC cidPC sid
In DepthDetails US Patent