BDBM31245 isoindolinone scaffold, 34
SMILES O=Cc1ccc(COC2(N(Cc3ccccc3)C(=O)c3ccccc23)c2ccccc2)o1
InChI Key InChIKey=YOERQPRARRQVCJ-UHFFFAOYSA-N
Data  1 IC50
  Tab Delimited (TSV)   2D SDfile   Computed 3D by Vconf -m prep SDfile
Find this compound or compounds like it in BindingDB:
Activity Spreadsheet -- Enzyme Inhibition Constant Data from BindingDB
Found 1 hit for monomerid = 31245
TargetE3 ubiquitin-protein ligase Mdm2(Homo sapiens (Human))
University of Newcastle Upon Tyne
LigandPNGBDBM31245(isoindolinone scaffold, 34)
Affinity DataIC50:  9.70E+4nMpH: 7.4 T: 2°C. Assay description: For initial testing, the compounds and controls were plated out in triplicate into clear 96-well plates (Nunc) in 10 ul aliquots to give final concen...
In DepthDetails ArticlePubMed