BDBM31271 isoindolinone scaffold, 67
SMILES CC(=C)C(=O)OCCN1C(=O)c2ccccc2C1(N[C@@H](CO)[C@@H](O)c1ccccc1)c1ccccc1
InChI Key InChIKey=WXRBVJFGGFIGTQ-QEGCZXFXSA-N
Data  1 IC50
  Tab Delimited (TSV)   2D SDfile   Computed 3D by Vconf -m prep SDfile
Find this compound or compounds like it in BindingDB:
Activity Spreadsheet -- Enzyme Inhibition Constant Data from BindingDB
Found 1 hit for monomerid = 31271
TargetE3 ubiquitin-protein ligase Mdm2(Homo sapiens (Human))
University of Newcastle Upon Tyne
LigandPNGBDBM31271(isoindolinone scaffold, 67)
Affinity DataIC50:  1.03E+5nM. Assay description: For initial testing, the compounds and controls were plated out in triplicate into clear 96-well plates (Nunc) in 10 ul aliquots to give final concen...
In DepthDetails ArticlePubMed