BDBM313067 N3-(4-(2-(2,5-dimethylpyrrolidin-1-yl)ethoxy)phenyl)-1-(quinoxalin-2-yl)-1H-1,2,4-triazole-3,5-diamine::US10166216, Compound 46
SMILES CC1CCC(C)N1CCOc1ccc(Nc2nc(N)n(n2)-c2cnc3ccccc3n2)cc1
InChI Key InChIKey=LPWDYZBPFKLEAL-UHFFFAOYSA-N
Data  1 IC50
  Tab Delimited (TSV)   2D SDfile   Computed 3D by Vconf -m prep SDfile
Find this compound or compounds like it in BindingDB:
Activity Spreadsheet -- Enzyme Inhibition Constant Data from BindingDB
Found 1 hit for monomerid = 313067
TargetTyrosine-protein kinase receptor UFO(Homo sapiens (Human))
Rigel Pharmaceuticals
US Patent
LigandPNGBDBM313067(N3-(4-(2-(2,5-dimethylpyrrolidin-1-yl)ethoxy)pheny...)
Affinity DataIC50: <1.00E+3nM. Assay description: The resulting chemiluminescence was read with a Luminomitor within 10 minutes to minimize changes in signal intensity. After reading the chemilumines...
Ligand InfoPC cidPC sid
In DepthDetails US Patent