BDBM313152 1-(phenanthridin-6-yl)-N3-(3-methyl-4-(4-pyrrolidin-1-ylpiperidin-1-yl)phenyl)-1H-1,2,4-triazole-3,5-diamine::US10166216, Compound 214
SMILES Cc1cc(Nc2nc(N)n(n2)-c2nc3ccccc3c3ccccc23)ccc1N1CCC(CC1)N1CCCC1
InChI Key InChIKey=CCQYKBLWGOJCAU-UHFFFAOYSA-N
Data  1 IC50
  Tab Delimited (TSV)   2D SDfile   Computed 3D by Vconf -m prep SDfile
Find this compound or compounds like it in BindingDB:
Activity Spreadsheet -- Enzyme Inhibition Constant Data from BindingDB
Found 1 hit for monomerid = 313152
TargetTyrosine-protein kinase receptor UFO(Homo sapiens (Human))
Rigel Pharmaceuticals
US Patent
LigandPNGBDBM313152(1-(phenanthridin-6-yl)-N3-(3-methyl-4-(4-pyrrolidi...)
Affinity DataIC50: <1.00E+3nM. Assay description: The resulting chemiluminescence was read with a Luminomitor within 10 minutes to minimize changes in signal intensity. After reading the chemilumines...
Ligand InfoPC cidPC sid
In DepthDetails US Patent