BDBM317603 US9624199, 13::[6-(3-Methoxypyrrolidin-1-yl)pyridin-3-yl][(3R)-3-methyl-1,4′-bipiperidin-1′-yl]methanone
SMILES COC1CCN(C1)c1ccc(cn1)C(=O)N1CCC(CC1)N1CCC[C@@H](C)C1
InChI Key InChIKey=MCZMOQGSZZEWQU-DIAVIDTQSA-N
Data  1 IC50
  Tab Delimited (TSV)   2D SDfile   Computed 3D by Vconf -m prep SDfile
Find this compound or compounds like it in BindingDB:
Activity Spreadsheet -- Enzyme Inhibition Constant Data from BindingDB
Found 1 hit for monomerid = 317603
TargetAlpha-1A adrenergic receptor(Homo sapiens (Human))
Bayer Pharma Aktiengesellschaft
US Patent
LigandPNGBDBM317603(US9624199, 13 | [6-(3-Methoxypyrrolidin-1-yl)pyrid...)
Affinity DataIC50:  12nM. Assay description: To prepare cell membranes with human α1- and α2-adrenergic receptors, CHO cells stably overexpressing α1- and α2-adrenergic recep...
Ligand InfoPC cidPC sid
In DepthDetails US Patent