BDBM31810 Apogossypol derivative, 8r
SMILES CC(CNC(=O)c1c(O)c(O)cc2c(O)c(c(C)cc12)-c1c(C)cc2c(C(=O)NCC(C)c3ccccc3)c(O)c(O)cc2c1O)c1ccccc1
InChI Key InChIKey=RAYNZUHYMMLQQA-UHFFFAOYSA-N
Data  12 IC50  1 Kd
  Tab Delimited (TSV)   2D SDfile   Computed 3D by Vconf -m prep SDfile
Find this compound or compounds like it in BindingDB:
Activity Spreadsheet -- Enzyme Inhibition Constant Data from BindingDB
Found 12 hits for monomerid = 31810
TargetBcl-2-like protein 1(Homo sapiens (Human))
Burnham Institute For Medical Research
LigandPNGBDBM31810(Apogossypol derivative, 8r)
Affinity DataIC50:  760nM Kd:  110nMpH: 7.4 T: 2°C. Assay description: FPAs were performed using various concentrations of GST-Bcl-2 family proteins, incubated with FITC-conjugated peptide substrates in the presence of i...
In DepthDetails ArticlePubMed
TargetApoptosis regulator Bcl-2(Homo sapiens (Human))
Burnham Institute For Medical Research
LigandPNGBDBM31810(Apogossypol derivative, 8r)
Affinity DataIC50:  320nMpH: 7.4 T: 2°C. Assay description: FPAs were performed using various concentrations of GST-Bcl-2 family proteins, incubated with FITC-conjugated peptide substrates in the presence of i...
In DepthDetails ArticlePubMed
TargetInduced myeloid leukemia cell differentiation protein Mcl-1(Homo sapiens (Human))
Burnham Institute For Medical Research
LigandPNGBDBM31810(Apogossypol derivative, 8r)
Affinity DataIC50:  280nMpH: 7.4 T: 2°C. Assay description: FPAs were performed using various concentrations of GST-Bcl-2 family proteins, incubated with FITC-conjugated peptide substrates in the presence of i...
In DepthDetails ArticlePubMed
TargetBcl-2-related protein A1(Homo sapiens (Human))
Burnham Institute For Medical Research
LigandPNGBDBM31810(Apogossypol derivative, 8r)
Affinity DataIC50:  730nMT: 2°C. Assay description: FPAs were performed using various concentrations of GST-Bcl-2 family proteins, incubated with FITC-conjugated peptide substrates in the presence of i...
In DepthDetails ArticlePubMed
TargetInduced myeloid leukemia cell differentiation protein Mcl-1(Homo sapiens (Human))
Burnham Institute For Medical Research
LigandPNGBDBM31810(Apogossypol derivative, 8r)
Affinity DataIC50:  330nM. Assay description: Displacement of FITC-labeled Bak BH3 peptide from Mcl-1 after 30 mins by fluorescence polarization assay
In DepthDetails ArticlePubMed
TargetInduced myeloid leukemia cell differentiation protein Mcl-1(Homo sapiens (Human))
Burnham Institute For Medical Research
LigandPNGBDBM31810(Apogossypol derivative, 8r)
Affinity DataIC50:  200nM. Assay description: Inhibition of Mcl-1 (unknown origin)
In DepthDetails PubMed
TargetApoptosis regulator Bcl-2(Homo sapiens (Human))
Burnham Institute For Medical Research
LigandPNGBDBM31810(Apogossypol derivative, 8r)
Affinity DataIC50:  660nM. Assay description: Displacement of FITC-labeled Bak BH3 peptide from Bcl-2 after 30 mins by fluorescence polarization assay
In DepthDetails ArticlePubMed
TargetBcl-2-like protein 1(Homo sapiens (Human))
Burnham Institute For Medical Research
LigandPNGBDBM31810(Apogossypol derivative, 8r)
Affinity DataIC50:  390nM. Assay description: Displacement of FITC-labeled Bak BH3 peptide from Bcl-XL after 30 mins by fluorescence polarization assay
In DepthDetails ArticlePubMed
TargetBcl-2-related protein A1(Homo sapiens (Human))
Burnham Institute For Medical Research
LigandPNGBDBM31810(Apogossypol derivative, 8r)
Affinity DataIC50:  620nM. Assay description: Inhibition of Bfl-1 (unknown origin) by fluorescence polarization assay
In DepthDetails PubMed
TargetBcl-2-like protein 1(Homo sapiens (Human))
Burnham Institute For Medical Research
LigandPNGBDBM31810(Apogossypol derivative, 8r)
Affinity DataIC50:  310nM. Assay description: Inhibition of Bcl-xl (unknown origin)
In DepthDetails PubMed
TargetApoptosis regulator Bcl-2(Homo sapiens (Human))
Burnham Institute For Medical Research
LigandPNGBDBM31810(Apogossypol derivative, 8r)
Affinity DataIC50:  320nM. Assay description: Inhibition of Bcl-2 (unknown origin)
In DepthDetails PubMed
TargetBcl-2-related protein A1(Homo sapiens (Human))
Burnham Institute For Medical Research
LigandPNGBDBM31810(Apogossypol derivative, 8r)
Affinity DataIC50:  420nM. Assay description: Displacement of FITC-labeled Bak BH3 peptide from Bfl-1 after 30 mins by fluorescence polarization assay
In DepthDetails ArticlePubMed