BDBM323045 (1R,2R)-N-(2-Methyl-4-oxo-4,5,6,7- tetrahydropyrazolo[1,5-a]pyrazin-3-yl)-2- [4-(5-methyl-1H-pyrazol-3- yl)benzoyl]cyclohexanecarboxamide::US10183947, Example 28::US10508119, Example 28::US11001589, Example 28::US11691978, Example 28
SMILES Cc1cc(n[nH]1)-c1ccc(cc1)C(=O)[C@@H]1CCCC[C@H]1C(=O)Nc1c(C)nn2CCNC(=O)c12
InChI Key
Data  1 IC50
  Tab Delimited (TSV)   2D SDfile   Computed 3D by Vconf -m prep SDfile
Find this compound or compounds like it in BindingDB:
Activity Spreadsheet -- Enzyme Inhibition Constant Data from BindingDB
Found 1 hit for monomerid = 323045
TargetArachidonate 5-lipoxygenase-activating protein(Homo sapiens (Human))
Astrazeneca
US Patent
LigandPNGBDBM323045((1R,2R)-N-(2-Methyl-4-oxo-4,5,6,7- tetrahydropyraz...)
Affinity DataIC50:  3.90nM. Assay description: Compounds were tested in a competition binding assay using 3H-MK591 as tracer. (Preparation of MK-591 is described in Bioorg. Med. Chem. Lett. 1999, ...
Ligand InfoPC cidPC sid
In DepthDetails US Patent