BDBM325605 US9636336, Example 23::US9636336, Example 86::US9636336, Example 87::[(1S)-2-(3,5-dichloro-1-oxido-pyridin-1-ium-4-yl)-1-(3,4-dimethoxyphenyl)ethyl]5-[[[2-[(1-methyl-4-piperidyl)methoxy]-2-oxo-1-phenyl-ethyl]amino]methyl]thiophene-2-carboxylate
SMILES COc1ccc(cc1OC)[C@H](Cc1c(Cl)c[n+]([O-])cc1Cl)OC(=O)c1ccc(CNC(C(=O)OCC2CCN(C)CC2)c2ccccc2)s1
InChI Key InChIKey=XYFHAWFMUWLTNQ-PTYUOYDSSA-N
Data  3 KI  11 IC50
  Tab Delimited (TSV)   2D SDfile   Computed 3D by Vconf -m prep SDfile
Find this compound or compounds like it in BindingDB:
Activity Spreadsheet -- Enzyme Inhibition Constant Data from BindingDB
Found 14 hits for monomerid = 325605
TargetMuscarinic acetylcholine receptor M3(Homo sapiens (Human))
Chiesi Farmaceutici
US Patent
LigandPNGBDBM325605(US9636336, Example 23 | US9636336, Example 86 | US...)
Affinity DataKi:  0.700nM. Assay description: Human M3 receptor membranes (15 μg/well) from Perkin Elmer are incubated with 0.52 nM Scopolamine Methyl Chloride, [N-methyl-3H] with or without...
Ligand InfoPC cidPC sid
In DepthDetails US Patent
TargetMuscarinic acetylcholine receptor M3(Homo sapiens (Human))
Chiesi Farmaceutici
US Patent
LigandPNGBDBM325605(US9636336, Example 23 | US9636336, Example 86 | US...)
Affinity DataKi:  10nM. Assay description: Displacement of [3H]-N-methyl Scopolamine Chloride from human M3 receptor membranes incubated for 2 hrs by scintillation counting analysis
Ligand InfoPC cidPC sid
In DepthDetails ArticlePubMed
TargetMuscarinic acetylcholine receptor M3(Homo sapiens (Human))
Chiesi Farmaceutici
US Patent
LigandPNGBDBM325605(US9636336, Example 23 | US9636336, Example 86 | US...)
Affinity DataKi:  10nM. Assay description: Displacement of [3H]-N-methyl Scopolamine Chloride from human M3 receptor membranes incubated for 2 hrs by scintillation counting analysis
Ligand InfoPC cidPC sid
In DepthDetails ArticlePubMed
TargetIsoform PDE4B2 of cAMP-specific 3',5'-cyclic phosphodiesterase 4B (PDE4B2)(Homo sapiens (Human))
Chiesi Farmaceutici
US Patent
LigandPNGBDBM325605(US9636336, Example 23 | US9636336, Example 86 | US...)
Affinity DataIC50:  5.5nM. Assay description: PDE4B2 activity is detected using the LANCE Ultra cAMP homogeneous time resolved fluorescence resonance energy transfer (TR-FRET) assay from Perkin E...
Ligand InfoPC cidPC sid
In DepthDetails US Patent
TargetMuscarinic acetylcholine receptor M3(Homo sapiens (Human))
Chiesi Farmaceutici
US Patent
LigandPNGBDBM325605(US9636336, Example 23 | US9636336, Example 86 | US...)
Affinity DataIC50:  5.5nM. Assay description: Human M3 receptor membranes (15 μg/well) from Perkin Elmer are incubated with 0.52 nM Scopolamine Methyl Chloride, [N-methyl-3H] with or without...
Ligand InfoPC cidPC sid
In DepthDetails US Patent
TargetIsoform PDE4B2 of cAMP-specific 3',5'-cyclic phosphodiesterase 4B (PDE4B2)(Homo sapiens (Human))
Chiesi Farmaceutici
US Patent
LigandPNGBDBM325605(US9636336, Example 23 | US9636336, Example 86 | US...)
Affinity DataIC50:  5.5nM. Assay description: PDE4B2 activity is detected using the LANCE Ultra cAMP homogeneous time resolved fluorescence resonance energy transfer (TR-FRET) assay from Perkin E...
Ligand InfoPC cidPC sid
In DepthDetails US Patent
TargetMuscarinic acetylcholine receptor M3(Homo sapiens (Human))
Chiesi Farmaceutici
US Patent
LigandPNGBDBM325605(US9636336, Example 23 | US9636336, Example 86 | US...)
Affinity DataIC50:  5.5nM. Assay description: Human M3 receptor membranes (15 μg/well) from Perkin Elmer are incubated with 0.52 nM Scopolamine Methyl Chloride, [N-methyl-3H] with or without...
Ligand InfoPC cidPC sid
In DepthDetails US Patent
TargetcAMP-specific 3',5'-cyclic phosphodiesterase 4B(Homo sapiens (Human))
Chiesi Farmaceutici
Curated by ChEMBL
LigandPNGBDBM325605(US9636336, Example 23 | US9636336, Example 86 | US...)
Affinity DataIC50:  0.794nM. Assay description: Inhibition of human recombinant PDE4B2 assessed as reduction in cAMP level incubated for 2 hrs by LANCE Ultra cAMP TR-FRET assay
Ligand InfoPC cidPC sid
In DepthDetails ArticlePubMed
TargetcAMP-specific 3',5'-cyclic phosphodiesterase 4B(Homo sapiens (Human))
Chiesi Farmaceutici
Curated by ChEMBL
LigandPNGBDBM325605(US9636336, Example 23 | US9636336, Example 86 | US...)
Affinity DataIC50:  0.794nM. Assay description: Inhibition of human recombinant PDE4B2 assessed as reduction in cAMP level incubated for 2 hrs by LANCE Ultra cAMP TR-FRET assay
Ligand InfoPC cidPC sid
In DepthDetails ArticlePubMed
TargetMuscarinic acetylcholine receptor M3(RAT)
Chiesi Farmaceutici
Curated by ChEMBL
LigandPNGBDBM325605(US9636336, Example 23 | US9636336, Example 86 | US...)
Affinity DataIC50:  63nM. Assay description: Antagonist activity at muscarinic M3 receptor in rat trachea assessed as inhibition of carbachol-induced contraction
Ligand InfoPC cidPC sid
In DepthDetails ArticlePubMed
TargetMuscarinic acetylcholine receptor M3(RAT)
Chiesi Farmaceutici
Curated by ChEMBL
LigandPNGBDBM325605(US9636336, Example 23 | US9636336, Example 86 | US...)
Affinity DataIC50:  63.1nM. Assay description: Antagonist activity at muscarinic M3 receptor in rat trachea assessed as inhibition of carbachol-induced contraction
Ligand InfoPC cidPC sid
In DepthDetails ArticlePubMed
TargetMuscarinic acetylcholine receptor M3(Homo sapiens (Human))
Chiesi Farmaceutici
US Patent
LigandPNGBDBM325605(US9636336, Example 23 | US9636336, Example 86 | US...)
Affinity DataIC50:  55nM. Assay description: Human M3 receptor membranes (15 μg/well) from Perkin Elmer are incubated with 0.52 nM Scopolamine Methyl Chloride, [N-methyl-3H] with or without...
Ligand InfoPC cidPC sid
In DepthDetails US Patent
TargetIsoform PDE4B2 of cAMP-specific 3',5'-cyclic phosphodiesterase 4B (PDE4B2)(Homo sapiens (Human))
Chiesi Farmaceutici
US Patent
LigandPNGBDBM325605(US9636336, Example 23 | US9636336, Example 86 | US...)
Affinity DataIC50:  5.5nM. Assay description: PDE4B2 activity is detected using the LANCE Ultra cAMP homogeneous time resolved fluorescence resonance energy transfer (TR-FRET) assay from Perkin E...
Ligand InfoPC cidPC sid
In DepthDetails US Patent
TargetMuscarinic acetylcholine receptor M3(Homo sapiens (Human))
Chiesi Farmaceutici
US Patent
LigandPNGBDBM325605(US9636336, Example 23 | US9636336, Example 86 | US...)
Affinity DataIC50:  1.30nM. Assay description: Human M3 receptor membranes (15 μg/well) from Perkin Elmer are incubated with 0.52 nM Scopolamine Methyl Chloride, [N-methyl-3H] with or without...
Ligand InfoPC cidPC sid
In DepthDetails US Patent