BDBM32667 3-furancarboxylic acid [2-(2-furanyl)-4-(phenyliminomethyl)-5-oxazolyl] ester::MLS000027589::SMR000040036::[2-(furan-2-yl)-4-(phenyliminomethyl)-1,3-oxazol-5-yl] furan-3-carboxylate::cid_659095::furan-3-carboxylic acid [2-(2-furyl)-4-(phenyliminomethyl)oxazol-5-yl] ester
SMILES O=C(Oc1oc(nc1\C=N\c1ccccc1)-c1ccco1)c1ccoc1
InChI Key InChIKey=YEUSDDRDTZYOCG-RGVLZGJSSA-N
Data  6 IC50  1 EC50
  Tab Delimited (TSV)   2D SDfile   Computed 3D by Vconf -m prep SDfile
Find this compound or compounds like it in BindingDB:
Activity Spreadsheet -- Enzyme Inhibition Constant Data from BindingDB
Found 7 hits for monomerid = 32667
TargetCoagulation factor XII(Homo sapiens (Human))
Pcmd
Curated by PubChem BioAssay
LigandPNGBDBM32667(3-furancarboxylic acid [2-(2-furanyl)-4-(phenylimi...)
Affinity DataIC50:  1.09E+4nMpH: 7.4 T: 2°C. Assay description: HTS was performed on a total of 33,068 compounds of the MLSCN library, 23,017 of which were not in the mixture HTS plates used previously. These comp...
In DepthDetails PCBioAssay
TargetProthrombin(Homo sapiens (Human))
Pcmd
Curated by PubChem BioAssay
LigandPNGBDBM32667(3-furancarboxylic acid [2-(2-furanyl)-4-(phenylimi...)
Affinity DataIC50:  1.37E+3nMpH: 7.5 T: 2°C. Assay description: HTS was performed using 217,350 compounds of the MLSCN library individually plated into 10ul 1536 compound plates at a concentration of 2.5 mM each, ...
In DepthDetails PCBioAssay
TargetCoagulation factor XI(Homo sapiens (Human))
Pcmd
Curated by PubChem BioAssay
LigandPNGBDBM32667(3-furancarboxylic acid [2-(2-furanyl)-4-(phenylimi...)
Affinity DataIC50: >5.00E+4nMpH: 7.4 T: 2°C. Assay description: Factor XIa (0.23 ug/mL) was incubated with Boc-Glu-Ala-Arg-AMC substrate (15 uM) in 10 uL of assay buffer for 2 hr at room temperature. Read fluoresc...
In DepthDetails PCBioAssay
TargetHeat shock factor protein 1(Mus musculus)
Broad Institute
Curated by PubChem BioAssay
LigandPNGBDBM32667(3-furancarboxylic acid [2-(2-furanyl)-4-(phenylimi...)
Affinity DataEC50: >1.95E+5nM. Assay description: Keywords: Heat Shock Factor-1 (HSF-1), Stress Response, MG132, NIH3T3, Luminescence Assay Overview: Modified NIH3T3, transformed to express firefly...
In DepthDetails PCBioAssay
TargetCoagulation factor XI(Homo sapiens (Human))
Pcmd
Curated by PubChem BioAssay
LigandPNGBDBM32667(3-furancarboxylic acid [2-(2-furanyl)-4-(phenylimi...)
Affinity DataIC50: >5.00E+4nM. Assay description: Molecular Library Screening Center Network (MLSCN) Penn Center for Molecular Discovery (PCMD) Assay Provider: Scott L. Diamond, University of Pennsy...
In DepthDetails PCBioAssay
TargetCoagulation factor XII(Homo sapiens (Human))
Pcmd
Curated by PubChem BioAssay
LigandPNGBDBM32667(3-furancarboxylic acid [2-(2-furanyl)-4-(phenylimi...)
Affinity DataIC50:  1.09E+4nM. Assay description: Molecular Library Screening Center Network (MLSCN) Penn Center for Molecular Discovery (PCMD) Assay Provider: Scott L. Diamond, University of Pennsy...
In DepthDetails PCBioAssay
TargetCoagulation factor XI(Homo sapiens (Human))
Pcmd
Curated by PubChem BioAssay
LigandPNGBDBM32667(3-furancarboxylic acid [2-(2-furanyl)-4-(phenylimi...)
Affinity DataIC50: >5.00E+4nMpH: 7.4 T: 2°C. Assay description: Factor XIa (0.23 ug/mL) was incubated with Boc-Glu-Ala-Arg-AMC substrate (15 uM) in 10 uL of assay buffer for 2 hr at room temperature. Read fluoresc...
In DepthDetails PCBioAssay