BDBM327847 US9663479, Pregabalin
SMILES CC(C)CC(CN)CC(O)=O
InChI Key InChIKey=AYXYPKUFHZROOJ-UHFFFAOYSA-N
Data  1 IC50
  Tab Delimited (TSV)   2D SDfile   Computed 3D by Vconf -m prep SDfile
Find this compound or compounds like it in BindingDB:
Activity Spreadsheet -- Enzyme Inhibition Constant Data from BindingDB
Found 1 hit for monomerid = 327847
LigandPNGBDBM327847(US9663479, Pregabalin)
Affinity DataIC50:  23nM. Assay description: This section describes a scintillation proximity assay (SPA) to measure [3H] gabapentin ([3H]GBP) binding to membranes containing α2δ-1 and...
In DepthDetails US Patent