BDBM327852 US9663479, Formula 1 (Racemic)
SMILES CCNC[C@]1(Cc2nnn[nH]2)C[C@H]2CC(CC)=C[C@@H]12
InChI Key
Data  1 IC50
  Tab Delimited (TSV)   2D SDfile   Computed 3D by Vconf -m prep SDfile
Find this compound or compounds like it in BindingDB:
Activity Spreadsheet -- Enzyme Inhibition Constant Data from BindingDB
Found 1 hit for monomerid = 327852
LigandPNGBDBM327852(US9663479, Formula 1 (Racemic))
Affinity DataIC50: >500nM. Assay description: This section describes a scintillation proximity assay (SPA) to measure [3H] gabapentin ([3H]GBP) binding to membranes containing α2δ-1 and...
Ligand InfoPC cidPC sid
In DepthDetails US Patent