BDBM32795 (3-amino-1,2,4-triazol-4-yl)-(3,4-dimethylphenyl)methanone::(3-azanyl-1,2,4-triazol-4-yl)-(3,4-dimethylphenyl)methanone::4-(3,4-dimethylbenzoyl)-4H-1,2,4-triazol-3-amine::MLS000063159::SMR000072096::cid_887464
SMILES Cc1ccc(cc1C)C(=O)n1cnnc1N
InChI Key InChIKey=NLGIEPHLRWKDDF-UHFFFAOYSA-N
Data  6 IC50
  Tab Delimited (TSV)   2D SDfile   Computed 3D by Vconf -m prep SDfile
Find this compound or compounds like it in BindingDB:
Activity Spreadsheet -- Enzyme Inhibition Constant Data from BindingDB
Found 6 hits for monomerid = 32795
TargetProthrombin(Homo sapiens (Human))
Pcmd
Curated by PubChem BioAssay
LigandPNGBDBM32795((3-amino-1,2,4-triazol-4-yl)-(3,4-dimethylphenyl)m...)
Affinity DataIC50:  1.87E+3nMpH: 7.5 T: 2°C. Assay description: HTS was performed using 217,350 compounds of the MLSCN library individually plated into 10ul 1536 compound plates at a concentration of 2.5 mM each, ...
In DepthDetails PCBioAssay
TargetCoagulation factor XI(Homo sapiens (Human))
Pcmd
Curated by PubChem BioAssay
LigandPNGBDBM32795((3-amino-1,2,4-triazol-4-yl)-(3,4-dimethylphenyl)m...)
Affinity DataIC50:  3.59E+3nMpH: 7.4 T: 2°C. Assay description: Factor XIa (0.23 ug/mL) was incubated with Boc-Glu-Ala-Arg-AMC substrate (15 uM) in 10 uL of assay buffer for 2 hr at room temperature. Read fluoresc...
In DepthDetails PCBioAssay
TargetKallikrein-5(Homo sapiens (Human))
Pcmd
Curated by PubChem BioAssay
LigandPNGBDBM32795((3-amino-1,2,4-triazol-4-yl)-(3,4-dimethylphenyl)m...)
Affinity DataIC50:  5.00E+4nM. Assay description: Molecular Library Screening Center Network (MLSCN) Penn Center for Molecular Discovery (PCMD) Assay Provider: Scott L. Diamond, University of Pennsy...
In DepthDetails PCBioAssay
TargetCathepsin G(Homo sapiens (Human))
Pcmd
Curated by PubChem BioAssay
LigandPNGBDBM32795((3-amino-1,2,4-triazol-4-yl)-(3,4-dimethylphenyl)m...)
Affinity DataIC50:  1.58E+3nM. Assay description: Screening Center: Penn Center for Molecular Discovery Center Affiliation: University of Pennsylvania Network: Molecular Library Screening Center Netw...
In DepthDetails PCBioAssay
TargetCoagulation factor XII(Homo sapiens (Human))
Pcmd
Curated by PubChem BioAssay
LigandPNGBDBM32795((3-amino-1,2,4-triazol-4-yl)-(3,4-dimethylphenyl)m...)
Affinity DataIC50:  2.98E+3nM. Assay description: Molecular Library Screening Center Network (MLSCN) Penn Center for Molecular Discovery (PCMD) Assay Provider: Scott L. Diamond, University of Pennsy...
In DepthDetails PCBioAssay
TargetCoagulation factor XII(Homo sapiens (Human))
Pcmd
Curated by PubChem BioAssay
LigandPNGBDBM32795((3-amino-1,2,4-triazol-4-yl)-(3,4-dimethylphenyl)m...)
Affinity DataIC50:  2.98E+3nM. Assay description: Molecular Library Screening Center Network (MLSCN) Penn Center for Molecular Discovery (PCMD) Assay Provider: Scott L. Diamond, University of Pennsy...
In DepthDetails PCBioAssay