BDBM328378 6-fluoro-1-((4-methoxy-3-(4-methylpiperazin-1-yl)phenyl)sulfonyl)-1H-indole::US9663498, Example 18
SMILES COc1ccc(cc1N1CCN(C)CC1)S(=O)(=O)n1ccc2ccc(F)cc12
InChI Key InChIKey=SCSWSUGKACTEML-UHFFFAOYSA-N
Data  1 IC50
  Tab Delimited (TSV)   2D SDfile   Computed 3D by Vconf -m prep SDfile
Find this compound or compounds like it in BindingDB:
Activity Spreadsheet -- Enzyme Inhibition Constant Data from BindingDB
Found 1 hit for monomerid = 328378
Target5-hydroxytryptamine receptor 6(Homo sapiens (Human))
Sunshine Lake Pharma
US Patent
LigandPNGBDBM328378(6-fluoro-1-((4-methoxy-3-(4-methylpiperazin-1-yl)p...)
Affinity DataIC50:  0.670nM. Assay description: The binding affinity of the compound of this invention to human 5-HT6 receptor expressed in CHO cell was evaluated by radioligand binding assay as fo...
Ligand InfoPC cidPC sid
In DepthDetails US Patent