BDBM328396 6-chloro-1-((3-(4-cyclopropylpiperazin-1-yl)-4-methoxyphenyl) sulfonyl)-3-(difluoromethyl)-1H-indole::US9663498, Example 39
SMILES COc1ccc(cc1N1CCN(CC1)C1CC1)S(=O)(=O)n1cc(C(F)F)c2ccc(Cl)cc12
InChI Key InChIKey=LYMZAKGJYMLURF-UHFFFAOYSA-N
Data  1 IC50
  Tab Delimited (TSV)   2D SDfile   Computed 3D by Vconf -m prep SDfile
Find this compound or compounds like it in BindingDB:
Activity Spreadsheet -- Enzyme Inhibition Constant Data from BindingDB
Found 1 hit for monomerid = 328396
Target5-hydroxytryptamine receptor 6(Homo sapiens (Human))
Sunshine Lake Pharma
US Patent
LigandPNGBDBM328396(6-chloro-1-((3-(4-cyclopropylpiperazin-1-yl)-4-met...)
Affinity DataIC50:  0.0920nM. Assay description: The binding affinity of the compound of this invention to human 5-HT6 receptor expressed in CHO cell was evaluated by radioligand binding assay as fo...
Ligand InfoPC cidPC sid
In DepthDetails US Patent