BDBM329818 (rac)-((1R,2R,3S,4R)-4-(2-(3,3-dimethyl-2,3-dihydrobenzofuran-5-yl)pyrazolo[1,5-::US10202389, Compound I-026::US9663525, Compound I-026::US9796725, Compound I-026
SMILES CC1(C)COc2ccc(cc12)-c1cc2nccc(N[C@@H]3C[C@H](COS(N)(=O)=O)[C@@H](O)[C@H]3O)n2n1
InChI Key InChIKey=UOHWMTBPUOELIU-LOFXOBHGSA-N
Data  3 IC50
  Tab Delimited (TSV)   2D SDfile   Computed 3D by Vconf -m prep SDfile
Find this compound or compounds like it in BindingDB:
Activity Spreadsheet -- Enzyme Inhibition Constant Data from BindingDB
Found 3 hits for monomerid = 329818
TargetUbiquitin-conjugating enzyme E2 E1(Homo sapiens (Human))
Millennium Pharmaceuticals
US Patent
LigandPNGBDBM329818((rac)-((1R,2R,3S,4R)-4-(2-(3,3-dimethyl-2,3-dihydr...)
Affinity DataIC50: <10nM. Assay description: The UAE enzymatic reaction totals 50 μL and contains 50 mmol HEPES (pH 7.5), 0.05% BSA, 2.5 mM MgCl2, 0.1 uM ATP, 8 nM GST-Ubc-2, 35 nM flag-ubi...
Ligand InfoPC cidPC sid
In DepthDetails US Patent
TargetSUMO-activating enzyme subunit 2(Homo sapiens (Human))
Millennium Pharmaceuticals
US Patent
LigandPNGBDBM329818((rac)-((1R,2R,3S,4R)-4-(2-(3,3-dimethyl-2,3-dihydr...)
Affinity DataIC50: <10nM. Assay description: he UAE enzymatic reaction totals 50 μL and contains 50 mmol HEPES (pH 7.5), 0.05% BSA, 2.5 mM MgCl2, 0.1 uM ATP, 8 nM GST-Ubc-2, 35 nM flag-ubiq...
Ligand InfoPC cidPC sid
In DepthDetails US Patent
TargetUbiquitin-like modifier-activating enzyme 1(Homo sapiens (Human))
Millennium Pharmaceuticals
US Patent
LigandPNGBDBM329818((rac)-((1R,2R,3S,4R)-4-(2-(3,3-dimethyl-2,3-dihydr...)
Affinity DataIC50: <10nM. Assay description: The UAE enzymatic reaction totals 50 μL and contains 50 mmol HEPES (pH 7.5), 0.05% BSA, 2.5 mM MgCl2, 0.1 uM ATP, 8 nM GST-Ubc-2, 35 nM flag-ubi...
Ligand InfoPC cidPC sid
In DepthDetails US Patent