BDBM329891 (rac)-rel-5-[7-({(1R,2S,3R,4R)-2,3-dihydroxy-4-::US10202389, Compound I-099::US9663525, Compound I-099
SMILES NS(=O)(=O)OC[C@H]1C[C@@H](Nc2ccnc3cc(nn23)-c2cccc3cc(ccc23)C(O)=O)[C@H](O)[C@@H]1O
InChI Key InChIKey=GUAHEWCHNSONQK-SRBBEKPSSA-N
Data  2 IC50
  Tab Delimited (TSV)   2D SDfile   Computed 3D by Vconf -m prep SDfile
Find this compound or compounds like it in BindingDB:
Activity Spreadsheet -- Enzyme Inhibition Constant Data from BindingDB
Found 2 hits for monomerid = 329891
TargetUbiquitin-like modifier-activating enzyme 1(Homo sapiens (Human))
Millennium Pharmaceuticals
US Patent
LigandPNGBDBM329891((rac)-rel-5-[7-({(1R,2S,3R,4R)-2,3-dihydroxy-4- | ...)
Affinity DataIC50: <10nM. Assay description: The UAE enzymatic reaction totals 50 μL and contains 50 mmol HEPES (pH 7.5), 0.05% BSA, 2.5 mM MgCl2, 0.1 uM ATP, 8 nM GST-Ubc-2, 35 nM flag-ubi...
Ligand InfoPC cidPC sid
In DepthDetails US Patent
TargetUbiquitin-conjugating enzyme E2 E1(Homo sapiens (Human))
Millennium Pharmaceuticals
US Patent
LigandPNGBDBM329891((rac)-rel-5-[7-({(1R,2S,3R,4R)-2,3-dihydroxy-4- | ...)
Affinity DataIC50: <10nM. Assay description: The UAE enzymatic reaction totals 50 μL and contains 50 mmol HEPES (pH 7.5), 0.05% BSA, 2.5 mM MgCl2, 0.1 uM ATP, 8 nM GST-Ubc-2, 35 nM flag-ubi...
Ligand InfoPC cidPC sid
In DepthDetails US Patent