BDBM330002 US10463675, Example 85::US10980815, Ex. No. 85::US11197867, Example 85::US9663526, Example 85
SMILES Cn1cc(Nc2nccc(n2)N2C[C@@H]3CC[C@H](C2)N3C(=O)NCC#N)cn1
InChI Key InChIKey=RDBPTNPTWAHSBQ-OKILXGFUSA-N
Data  28 IC50
  Tab Delimited (TSV)   2D SDfile   Computed 3D by Vconf -m prep SDfile
Find this compound or compounds like it in BindingDB:
Activity Spreadsheet -- Enzyme Inhibition Constant Data from BindingDB
Found 28 hits for monomerid = 330002
TargetNon-receptor tyrosine-protein kinase TYK2(Homo sapiens (Human))
Pfizer
US Patent
LigandPNGBDBM330002(US10463675, Example 85 | US10980815, Ex. No. 85 | ...)
Affinity DataIC50:  16nM. Assay description: Compounds were added to a 384-well plate. Reaction mixtures contained 10 mM HEPES, pH 7.4, 10 mM MgCl2, 0.01% BSA, 0.0005% Tween 20, 1 mM ATP and 1 &...
Ligand InfoPC cidPC sid
In DepthDetails US Patent
TargetTyrosine-protein kinase JAK3(Homo sapiens (Human))
Pfizer
US Patent
LigandPNGBDBM330002(US10463675, Example 85 | US10980815, Ex. No. 85 | ...)
Affinity DataIC50:  2.48E+3nM. Assay description: Compounds were added to a 384-well plate. Reaction mixtures contained 10 mM HEPES, pH 7.4, 10 mM MgCl2, 0.01% BSA, 0.0005% Tween 20, 1 mM ATP and 1 M...
Ligand InfoPC cidPC sid
In DepthDetails US Patent
TargetTyrosine-protein kinase JAK2(Homo sapiens (Human))
Pfizer
US Patent
LigandPNGBDBM330002(US10463675, Example 85 | US10980815, Ex. No. 85 | ...)
Affinity DataIC50:  67nM
Ligand InfoPC cidPC sid
In DepthDetails US Patent
TargetTyrosine-protein kinase JAK3(Homo sapiens (Human))
Pfizer
US Patent
LigandPNGBDBM330002(US10463675, Example 85 | US10980815, Ex. No. 85 | ...)
Affinity DataIC50:  2.48E+3nM
Ligand InfoPC cidPC sid
In DepthDetails US Patent
TargetNon-receptor tyrosine-protein kinase TYK2(Homo sapiens (Human))
Pfizer
US Patent
LigandPNGBDBM330002(US10463675, Example 85 | US10980815, Ex. No. 85 | ...)
Affinity DataIC50:  16nM. Assay description: Compounds were added to a 384-well plate. Reaction mixtures contained 10 mM HEPES, pH 7.4, 10 mM MgCl2, 0.01% BSA, 0.0005% Tween 20, 1 mM ATP and 1 &...
Ligand InfoPC cidPC sid
In DepthDetails US Patent
TargetTyrosine-protein kinase JAK1(Homo sapiens (Human))
Pfizer
US Patent
LigandPNGBDBM330002(US10463675, Example 85 | US10980815, Ex. No. 85 | ...)
Affinity DataIC50:  13nM. Assay description: Compounds were added to a 384-well plate. Reaction mixtures contained 10 mM HEPES, pH 7.4, 10 mM MgCl2, 0.01% BSA, 0.0005% Tween 20, 1 mM ATP and 1 &...
Ligand InfoPC cidPC sid
In DepthDetails US Patent
TargetTyrosine-protein kinase JAK2(Homo sapiens (Human))
Pfizer
US Patent
LigandPNGBDBM330002(US10463675, Example 85 | US10980815, Ex. No. 85 | ...)
Affinity DataIC50:  67nM. Assay description: Compounds were added to a 384-well plate. Reaction mixtures contained 10 mM HEPES, pH 7.4, 10 mM MgCl2, 0.01% BSA, 0.0005% Tween 20, 1 mM ATP and 1 &...
Ligand InfoPC cidPC sid
In DepthDetails US Patent
TargetTyrosine-protein kinase JAK3(Homo sapiens (Human))
Pfizer
US Patent
LigandPNGBDBM330002(US10463675, Example 85 | US10980815, Ex. No. 85 | ...)
Affinity DataIC50:  2.48E+3nM. Assay description: Compounds were added to a 384-well plate. Reaction mixtures contained 10 mM HEPES, pH 7.4, 10 mM MgCl2, 0.01% BSA, 0.0005% Tween 20, 1 mM ATP and 1 &...
Ligand InfoPC cidPC sid
In DepthDetails US Patent
LigandPNGBDBM330002(US10463675, Example 85 | US10980815, Ex. No. 85 | ...)
Affinity DataIC50:  120nM. Assay description: Inhibition of JAK1/TYK2 signaling pathway in human lymphocytes of whole blood assessed as reduction in IFN-alpha induced STAT3 phosphorylation preinc...
Ligand InfoPC cidPC sid
In DepthDetails ArticlePubMed
TargetNon-receptor tyrosine-protein kinase TYK2(Homo sapiens (Human))
Pfizer
US Patent
LigandPNGBDBM330002(US10463675, Example 85 | US10980815, Ex. No. 85 | ...)
Affinity DataIC50:  16nM. Assay description: Inhibition of human TYK2 using fluorescence labeled peptide as substrate and using 1 mM ATP level by microfluidic based mobility shift assay
Ligand InfoPC cidPC sid
In DepthDetails ArticlePubMed
TargetTyrosine-protein kinase JAK1(Homo sapiens (Human))
Pfizer
US Patent
LigandPNGBDBM330002(US10463675, Example 85 | US10980815, Ex. No. 85 | ...)
Affinity DataIC50:  13nM. Assay description: Inhibition of human JAK1 using fluorescence labeled peptide as substrate and using 1 mM ATP by microfluidic based mobility shift assay
Ligand InfoPC cidPC sid
In DepthDetails ArticlePubMed
TargetTyrosine-protein kinase JAK2(Homo sapiens (Human))
Pfizer
US Patent
LigandPNGBDBM330002(US10463675, Example 85 | US10980815, Ex. No. 85 | ...)
Affinity DataIC50:  1.23E+3nM. Assay description: Inhibition of JAK2 homodimer signaling pathway in human spiked CD34 +ve cells of whole blood assessed as reduction in EPO induced STAT5 phosphorylati...
Ligand InfoPC cidPC sid
In DepthDetails ArticlePubMed
TargetNon-receptor tyrosine-protein kinase TYK2(Homo sapiens (Human))
Pfizer
US Patent
LigandPNGBDBM330002(US10463675, Example 85 | US10980815, Ex. No. 85 | ...)
Affinity DataIC50:  16nM. Assay description: Inhibition of human TYK2 using fluorescence labeled peptide as substrate and using 1 mM ATP level by microfluidic based mobility shift assay
Ligand InfoPC cidPC sid
In DepthDetails ArticlePubMed
TargetTyrosine-protein kinase JAK1(Homo sapiens (Human))
Pfizer
US Patent
LigandPNGBDBM330002(US10463675, Example 85 | US10980815, Ex. No. 85 | ...)
Affinity DataIC50:  13nM. Assay description: Inhibition of human JAK1 using fluorescence labeled peptide as substrate and using 1 mM ATP by microfluidic based mobility shift assay
Ligand InfoPC cidPC sid
In DepthDetails ArticlePubMed
TargetTyrosine-protein kinase JAK3(Homo sapiens (Human))
Pfizer
US Patent
LigandPNGBDBM330002(US10463675, Example 85 | US10980815, Ex. No. 85 | ...)
Affinity DataIC50:  2.48E+3nM. Assay description: Inhibition of human JAK3 using fluorescence labeled peptide as substrate and using 1 mM ATP by microfluidic based mobility shift assay
Ligand InfoPC cidPC sid
In DepthDetails ArticlePubMed
TargetTyrosine-protein kinase JAK2(Homo sapiens (Human))
Pfizer
US Patent
LigandPNGBDBM330002(US10463675, Example 85 | US10980815, Ex. No. 85 | ...)
Affinity DataIC50:  67nM. Assay description: Inhibition of human JAK2 using fluorescence labeled peptide as substrate and using 1 mM ATP by microfluidic based mobility shift assay
Ligand InfoPC cidPC sid
In DepthDetails ArticlePubMed
TargetTyrosine-protein kinase JAK2(Homo sapiens (Human))
Pfizer
US Patent
LigandPNGBDBM330002(US10463675, Example 85 | US10980815, Ex. No. 85 | ...)
Affinity DataIC50:  1.23E+3nM. Assay description: Inhibition of JAK2 homodimer signaling pathway in human spiked CD34 +ve cells of whole blood assessed as reduction in EPO induced STAT5 phosphorylati...
Ligand InfoPC cidPC sid
In DepthDetails ArticlePubMed
LigandPNGBDBM330002(US10463675, Example 85 | US10980815, Ex. No. 85 | ...)
Affinity DataIC50:  120nM. Assay description: Inhibition of JAK1/TYK2 signaling pathway in human lymphocytes of whole blood assessed as reduction in IFN-alpha induced STAT3 phosphorylation preinc...
Ligand InfoPC cidPC sid
In DepthDetails ArticlePubMed
TargetTyrosine-protein kinase JAK2(Homo sapiens (Human))
Pfizer
US Patent
LigandPNGBDBM330002(US10463675, Example 85 | US10980815, Ex. No. 85 | ...)
Affinity DataIC50:  67nM. Assay description: Inhibition of human JAK2 using fluorescence labeled peptide as substrate and using 1 mM ATP by microfluidic based mobility shift assay
Ligand InfoPC cidPC sid
In DepthDetails ArticlePubMed
TargetTyrosine-protein kinase JAK3(Homo sapiens (Human))
Pfizer
US Patent
LigandPNGBDBM330002(US10463675, Example 85 | US10980815, Ex. No. 85 | ...)
Affinity DataIC50:  2.48E+3nM. Assay description: Inhibition of human JAK3 using fluorescence labeled peptide as substrate and using 1 mM ATP by microfluidic based mobility shift assay
Ligand InfoPC cidPC sid
In DepthDetails ArticlePubMed
TargetNon-receptor tyrosine-protein kinase TYK2(Homo sapiens (Human))
Pfizer
US Patent
LigandPNGBDBM330002(US10463675, Example 85 | US10980815, Ex. No. 85 | ...)
Affinity DataIC50:  16nM. Assay description: Compounds were added to a 384-well plate. Reaction mixtures contained 10 mM HEPES, pH 7.4, 10 mM MgCl2, 0.01% BSA, 0.0005% Tween 20, 1 mM ATP and 1 &...
Ligand InfoPC cidPC sid
In DepthDetails US Patent
TargetTyrosine-protein kinase JAK1(Homo sapiens (Human))
Pfizer
US Patent
LigandPNGBDBM330002(US10463675, Example 85 | US10980815, Ex. No. 85 | ...)
Affinity DataIC50:  13nM. Assay description: Compounds were added to a 384-well plate. Reaction mixtures contained 10 mM HEPES, pH 7.4, 10 mM MgCl2, 0.01% BSA, 0.0005% Tween 20, 1 mM ATP and 1 &...
Ligand InfoPC cidPC sid
In DepthDetails US Patent
TargetTyrosine-protein kinase JAK2(Homo sapiens (Human))
Pfizer
US Patent
LigandPNGBDBM330002(US10463675, Example 85 | US10980815, Ex. No. 85 | ...)
Affinity DataIC50:  67nM. Assay description: Compounds were added to a 384-well plate. Reaction mixtures contained 10 mM HEPES, pH 7.4, 10 mM MgCl2, 0.01% BSA, 0.0005% Tween 20, 1 mM ATP and 1 &...
Ligand InfoPC cidPC sid
In DepthDetails US Patent
TargetTyrosine-protein kinase JAK3(Homo sapiens (Human))
Pfizer
US Patent
LigandPNGBDBM330002(US10463675, Example 85 | US10980815, Ex. No. 85 | ...)
Affinity DataIC50:  2.48E+3nM. Assay description: Compounds were added to a 384-well plate. Reaction mixtures contained 10 mM HEPES, pH 7.4, 10 mM MgCl2, 0.01% BSA, 0.0005% Tween 20, 1 mM ATP and 1 &...
Ligand InfoPC cidPC sid
In DepthDetails US Patent
TargetNon-receptor tyrosine-protein kinase TYK2(Homo sapiens (Human))
Pfizer
US Patent
LigandPNGBDBM330002(US10463675, Example 85 | US10980815, Ex. No. 85 | ...)
Affinity DataIC50:  16nM. Assay description: Compounds were added to a 384-well plate. Reaction mixtures contained 10 mM HEPES, pH 7.4, 10 mM MgCl2, 0.01% BSA, 0.0005% Tween 20, 1 mM ATP and 1 M...
Ligand InfoPC cidPC sid
In DepthDetails US Patent
TargetTyrosine-protein kinase JAK1(Homo sapiens (Human))
Pfizer
US Patent
LigandPNGBDBM330002(US10463675, Example 85 | US10980815, Ex. No. 85 | ...)
Affinity DataIC50:  13nM. Assay description: Compounds were added to a 384-well plate. Reaction mixtures contained 10 mM HEPES, pH 7.4, 10 mM MgCl2, 0.01% BSA, 0.0005% Tween 20, 1 mM ATP and 1 M...
Ligand InfoPC cidPC sid
In DepthDetails US Patent
TargetTyrosine-protein kinase JAK2(Homo sapiens (Human))
Pfizer
US Patent
LigandPNGBDBM330002(US10463675, Example 85 | US10980815, Ex. No. 85 | ...)
Affinity DataIC50:  67nM. Assay description: Compounds were added to a 384-well plate. Reaction mixtures contained 10 mM HEPES, pH 7.4, 10 mM MgCl2, 0.01% BSA, 0.0005% Tween 20, 1 mM ATP and 1 M...
Ligand InfoPC cidPC sid
In DepthDetails US Patent
TargetTyrosine-protein kinase JAK1(Homo sapiens (Human))
Pfizer
US Patent
LigandPNGBDBM330002(US10463675, Example 85 | US10980815, Ex. No. 85 | ...)
Affinity DataIC50:  13nM
Ligand InfoPC cidPC sid
In DepthDetails US Patent