BDBM332789 US10196390, Compound I-62
SMILES Fc1cccc(F)c1-c1nc2CNC(=O)c2c(Nc2ccc(CC(=O)N3CC4(COC4)C3)cc2)n1
InChI Key InChIKey=HNWGWZAGRUXXDW-UHFFFAOYSA-N
Data  2 KI
  Tab Delimited (TSV)   2D SDfile   Computed 3D by Vconf -m prep SDfile
Find this compound or compounds like it in BindingDB:
Activity Spreadsheet -- Enzyme Inhibition Constant Data from BindingDB
Found 2 hits for monomerid = 332789
TargetNon-receptor tyrosine-protein kinase TYK2(Homo sapiens (Human))
Nimbus Lakshmi
US Patent
LigandPNGBDBM332789(US10196390, Compound I-62)
Affinity DataKi: <10nM. Assay description: The caliper machine employs an off chip mobility shift assay to detect phosphorylated peptide substrates from kinase assays, using microfluidics tech...
Ligand InfoPC cidPC sid
In DepthDetails US Patent
TargetTyrosine-protein kinase JAK2(Homo sapiens (Human))
Nimbus Lakshmi
US Patent
LigandPNGBDBM332789(US10196390, Compound I-62)
Affinity DataKi:  550nM
Ligand InfoPC cidPC sid
In DepthDetails US Patent