BDBM332817 US10196390, Compound I-91
SMILES Fc1cccc(F)c1-c1cc(Nc2ccc(cn2)[C@H]2CCNC2=O)c2C(=O)NCc2n1
InChI Key InChIKey=FWZFOAMOBATUEK-GFCCVEGCSA-N
Data  2 KI
  Tab Delimited (TSV)   2D SDfile   Computed 3D by Vconf -m prep SDfile
Find this compound or compounds like it in BindingDB:
Activity Spreadsheet -- Enzyme Inhibition Constant Data from BindingDB
Found 2 hits for monomerid = 332817
TargetNon-receptor tyrosine-protein kinase TYK2(Homo sapiens (Human))
Nimbus Lakshmi
US Patent
LigandPNGBDBM332817(US10196390, Compound I-91)
Affinity DataKi: <10nM. Assay description: The caliper machine employs an off chip mobility shift assay to detect phosphorylated peptide substrates from kinase assays, using microfluidics tech...
Ligand InfoPC cidPC sid
In DepthDetails US Patent
TargetTyrosine-protein kinase JAK2(Homo sapiens (Human))
Nimbus Lakshmi
US Patent
LigandPNGBDBM332817(US10196390, Compound I-91)
Affinity DataKi:  55nM
Ligand InfoPC cidPC sid
In DepthDetails US Patent