BDBM333433 US9737522, Compound 7
SMILES COc1cc(C)ccc1C1N(CCc2c[nH]c3ccccc23)C(=O)C(O)=C1C(C)=O
InChI Key
Data  1 IC50
  Tab Delimited (TSV)   2D SDfile   Computed 3D by Vconf -m prep SDfile
Find this compound or compounds like it in BindingDB:
Activity Spreadsheet -- Enzyme Inhibition Constant Data from BindingDB
Found 1 hit for monomerid = 333433
TargetNuclear receptor subfamily 2 group C member 1(Rattus norvegicus (Rat))
Emory University
US Patent
LigandPNGBDBM333433(US9737522, Compound 7)
Affinity DataIC50:  2.00E+4nM. Assay description: Two-electrode voltage-clamp recordings were made from Xenopus laevis oocytes expressing recombinant rat GluN1/GluN2A, GluN1/GluN2B, GluN1/GluN2C, Glu...
Ligand InfoPC cidPC sid
In DepthDetails US Patent