BDBM333451 US9737522, Compound 16
SMILES Cc1ccc(cc1)C1N(CCc2c[nH]cn2)C(=O)C(O)=C1C(=O)c1ccncc1
InChI Key
Data  1 IC50
  Tab Delimited (TSV)   2D SDfile   Computed 3D by Vconf -m prep SDfile
Find this compound or compounds like it in BindingDB:
Activity Spreadsheet -- Enzyme Inhibition Constant Data from BindingDB
Found 1 hit for monomerid = 333451
TargetNuclear receptor subfamily 2 group C member 1(Rattus norvegicus (Rat))
Emory University
US Patent
LigandPNGBDBM333451(US9737522, Compound 16)
Affinity DataIC50:  1.00E+5nM. Assay description: Two-electrode voltage-clamp recordings were made from Xenopus laevis oocytes expressing recombinant rat GluN1/GluN2A, GluN1/GluN2B, GluN1/GluN2C, Glu...
Ligand InfoPC cidPC sid
In DepthDetails US Patent