BDBM33434 1-(2-methyl-3-furoyl)-1H-1,2,3-benzotriazole::1-benzotriazolyl-(2-methyl-3-furanyl)methanone::MLS000066844::SMR000072033::benzotriazol-1-yl-(2-methyl-3-furyl)methanone::benzotriazol-1-yl-(2-methylfuran-3-yl)methanone::cid_898637
SMILES Cc1occc1C(=O)n1nnc2ccccc12
InChI Key InChIKey=DTUKMQFBFZXVKB-UHFFFAOYSA-N
Data  4 IC50
  Tab Delimited (TSV)   2D SDfile   Computed 3D by Vconf -m prep SDfile
Find this compound or compounds like it in BindingDB:
Activity Spreadsheet -- Enzyme Inhibition Constant Data from BindingDB
Found 4 hits for monomerid = 33434
TargetCoagulation factor XII(Homo sapiens (Human))
Pcmd
Curated by PubChem BioAssay
LigandPNGBDBM33434(1-(2-methyl-3-furoyl)-1H-1,2,3-benzotriazole | 1-b...)
Affinity DataIC50:  8.96E+3nMpH: 7.4 T: 2°C. Assay description: HTS was performed on a total of 33,068 compounds of the MLSCN library, 23,017 of which were not in the mixture HTS plates used previously. These comp...
In DepthDetails PCBioAssay
TargetCruzipain(Trypanosoma cruzi)
University Of California San Francisco
Curated by ChEMBL
LigandPNGBDBM33434(1-(2-methyl-3-furoyl)-1H-1,2,3-benzotriazole | 1-b...)
Affinity DataIC50: <6.00E+5nM. Assay description: Inhibition of cruzain
In DepthDetails ArticlePubMed
TargetCruzipain(Trypanosoma cruzi)
University Of California San Francisco
Curated by ChEMBL
LigandPNGBDBM33434(1-(2-methyl-3-furoyl)-1H-1,2,3-benzotriazole | 1-b...)
Affinity DataIC50:  1.06E+5nM. Assay description: Inhibition of cruzain
In DepthDetails ArticlePubMed
TargetCoagulation factor XII(Homo sapiens (Human))
Pcmd
Curated by PubChem BioAssay
LigandPNGBDBM33434(1-(2-methyl-3-furoyl)-1H-1,2,3-benzotriazole | 1-b...)
Affinity DataIC50:  8.96E+3nM. Assay description: Molecular Library Screening Center Network (MLSCN) Penn Center for Molecular Discovery (PCMD) Assay Provider: Scott L. Diamond, University of Pennsy...
In DepthDetails PCBioAssay