BDBM33469 (4-morpholin-4-yl-1,2,5-thiadiazol-3-yl) benzoate::MLS000519185::SMR000129604::benzoic acid (4-morpholino-1,2,5-thiadiazol-3-yl) ester::benzoic acid [4-(4-morpholinyl)-1,2,5-thiadiazol-3-yl] ester::cid_674516
SMILES O=C(Oc1nsnc1N1CCOCC1)c1ccccc1
InChI Key InChIKey=RQOPSFJRTNGANZ-UHFFFAOYSA-N
Data  2 IC50
  Tab Delimited (TSV)   2D SDfile   Computed 3D by Vconf -m prep SDfile
Find this compound or compounds like it in BindingDB:
Activity Spreadsheet -- Enzyme Inhibition Constant Data from BindingDB
Found 2 hits for monomerid = 33469
TargetImmunoglobulin A1 protease autotransporter(Haemophilus influenzae (strain ATCC 51907 / DSM 11...)
University Of Bath
Curated by ChEMBL
LigandPNGBDBM33469((4-morpholin-4-yl-1,2,5-thiadiazol-3-yl) benzoate ...)
Affinity DataIC50:  5.90E+3nM. Assay description: Inhibition of Haemophilus influenzae Rd IGA1 protease expressed in Escherichia coli BL21(DE3) preincubated for 1 hr followed by substrate addition an...
In DepthDetails ArticlePubMed
TargetCoagulation factor XII(Homo sapiens (Human))
Pcmd
Curated by PubChem BioAssay
LigandPNGBDBM33469((4-morpholin-4-yl-1,2,5-thiadiazol-3-yl) benzoate ...)
Affinity DataIC50:  4.38E+3nMpH: 7.4 T: 2°C. Assay description: HTS was performed on a total of 33,068 compounds of the MLSCN library, 23,017 of which were not in the mixture HTS plates used previously. These comp...
In DepthDetails PCBioAssay