BDBM335698 (R)-3-(3-Methyl-2-oxopiperidin-3-yl)-6-(5-methylquinolin-3-yl)pyridin-2(1H)-one::US9738626, 1 (free base)
SMILES Cc1cccc2ncc(cc12)-c1ccc(c(=O)[nH]1)[C@@]1(C)CCCNC1=O
InChI Key InChIKey=OJVNYQOKTZLPPX-OAQYLSRUSA-N
Data  1 KI
  Tab Delimited (TSV)   2D SDfile   Computed 3D by Vconf -m prep SDfile
Find this compound or compounds like it in BindingDB:
Activity Spreadsheet -- Enzyme Inhibition Constant Data from BindingDB
Found 1 hit for monomerid = 335698
TargetProstaglandin E2 receptor EP3 subtype(Homo sapiens (Human))
Pfizer
US Patent
LigandPNGBDBM335698((R)-3-(3-Methyl-2-oxopiperidin-3-yl)-6-(5-methylqu...)
Affinity DataKi:  3.30nM. Assay description: To measure the ability of test compounds in the present invention to bind to the human EP3 receptor, and therefore have the potential to antagonize P...
In DepthDetails US Patent