BDBM335702 (R)-6-(5-Cyclopropylquinolin-7-yl)-3-(3-methyl-2-oxopiperidin-3-yl)pyridin-2(1H)-one::US9738626, 5 (TFA salt)
SMILES C[C@@]1(CCCNC1=O)c1ccc([nH]c1=O)-c1cc(C2CC2)c2cccnc2c1
InChI Key InChIKey=JXKXDDNPECXKSM-HSZRJFAPSA-N
Data  1 KI
  Tab Delimited (TSV)   2D SDfile   Computed 3D by Vconf -m prep SDfile
Find this compound or compounds like it in BindingDB:
Activity Spreadsheet -- Enzyme Inhibition Constant Data from BindingDB
Found 1 hit for monomerid = 335702
TargetProstaglandin E2 receptor EP3 subtype(Homo sapiens (Human))
Pfizer
US Patent
LigandPNGBDBM335702((R)-6-(5-Cyclopropylquinolin-7-yl)-3-(3-methyl-2-o...)
Affinity DataKi:  7.30nM. Assay description: To measure the ability of test compounds in the present invention to bind to the human EP3 receptor, and therefore have the potential to antagonize P...
Ligand InfoPC cidPC sid
In DepthDetails US Patent