BDBM338837 US9751886, Compound 2
SMILES C[C@]1(Cn2nncc2C(N)=N1)c1cc(NC(=O)c2ccc(cn2)C#N)ccc1F
InChI Key InChIKey=XIOGEDRAOXMYRT-IBGZPJMESA-N
Data  10 IC50
  Tab Delimited (TSV)   2D SDfile   Computed 3D by Vconf -m prep SDfile
Find this compound or compounds like it in BindingDB:
Activity Spreadsheet -- Enzyme Inhibition Constant Data from BindingDB
Found 10 hits for monomerid = 338837
TargetBeta-secretase 1(Homo sapiens (Human))
Janssen Pharmaceutica
US Patent
LigandPNGBDBM338837(US9751886, Compound 2)
Affinity DataIC50:  1.78nM. Assay description: This assay is a Fluorescence Resonance Energy Transfer Assay (FRET) based assay. The substrate for this assay is an APP derived 13 amino acids peptid...
Ligand InfoPC cidPC sid
In DepthDetails US Patent
TargetBeta-secretase 1(Homo sapiens (Human))
Janssen Pharmaceutica
US Patent
LigandPNGBDBM338837(US9751886, Compound 2)
Affinity DataIC50:  1.78nM. Assay description: This assay is a Fluorescence Resonance Energy Transfer Assay (FRET) based assay. The substrate for this assay is an APP derived 13 amino acids peptid...
Ligand InfoPC cidPC sid
In DepthDetails US Patent
TargetBeta-secretase 2(Homo sapiens (Human))
Janssen Pharmaceutica
US Patent
LigandPNGBDBM338837(US9751886, Compound 2)
Affinity DataIC50:  5.37nM. Assay description: This assay is a Fluorescence Resonance Energy Transfer Assay (FRET) based assay. The substrate for this assay contains the ¿Swedish¿ Lys-Met/Asn-Leu ...
Ligand InfoPC cidPC sid
In DepthDetails US Patent
TargetPotassium voltage-gated channel subfamily H member 1(Homo sapiens)
Janssen Research & Development
Curated by ChEMBL
LigandPNGBDBM338837(US9751886, Compound 2)
Affinity DataIC50:  7.24E+3nM. Assay description: Inhibition of human ERG
Ligand InfoPC cidPC sid
In DepthDetails ArticlePubMed
TargetBeta-secretase 2(Homo sapiens (Human))
Janssen Pharmaceutica
US Patent
LigandPNGBDBM338837(US9751886, Compound 2)
Affinity DataIC50:  5.30nM. Assay description: Inhibition of BACE2 (unknown origin)
Ligand InfoPC cidPC sid
In DepthDetails ArticlePubMed
TargetBeta-secretase 2(Homo sapiens (Human))
Janssen Pharmaceutica
US Patent
LigandPNGBDBM338837(US9751886, Compound 2)
Affinity DataIC50:  5.5nM. Assay description: Inhibition of BACE2 (unknown origin)
Ligand InfoPC cidPC sid
In DepthDetails ArticlePubMed
TargetBeta-secretase 1(Homo sapiens (Human))
Janssen Pharmaceutica
US Patent
LigandPNGBDBM338837(US9751886, Compound 2)
Affinity DataIC50:  2nM. Assay description: Inhibition of BACE1 (unknown origin)
Ligand InfoPC cidPC sid
In DepthDetails ArticlePubMed
TargetBeta-secretase 1(Homo sapiens (Human))
Janssen Pharmaceutica
US Patent
LigandPNGBDBM338837(US9751886, Compound 2)
Affinity DataIC50:  1nM. Assay description: Inhibition of BACE1 (unknown origin) by cell-based assay
Ligand InfoPC cidPC sid
In DepthDetails ArticlePubMed
TargetBeta-secretase 1(Homo sapiens (Human))
Janssen Pharmaceutica
US Patent
LigandPNGBDBM338837(US9751886, Compound 2)
Affinity DataIC50:  1.70nM. Assay description: Inhibition of BACE1 (unknown origin)
Ligand InfoPC cidPC sid
In DepthDetails ArticlePubMed
TargetBeta-secretase 1(Homo sapiens (Human))
Janssen Pharmaceutica
US Patent
LigandPNGBDBM338837(US9751886, Compound 2)
Affinity DataIC50:  1.20nM. Assay description: Inhibition of BACE1 in human SKNBE2 cells expressing wild type amyloid precursor protein (APP695) assessed as amyloid beta42 level incubated for 18 h...
Ligand InfoPC cidPC sid
In DepthDetails ArticlePubMed