BDBM339048 US10201546, Example 12a
SMILES COc1nc2ccc(cc2c(Cl)c1C)C(O)(c1cnnn1C)c1ccc(C)nc1C
InChI Key InChIKey=ACQHAIZGTGISMN-UHFFFAOYSA-N
Data  2 IC50  2 Kd
  Tab Delimited (TSV)   2D SDfile   Computed 3D by Vconf -m prep SDfile
Find this compound or compounds like it in BindingDB:
Activity Spreadsheet -- Enzyme Inhibition Constant Data from BindingDB
Found 4 hits for monomerid = 339048
TargetNuclear receptor ROR-gamma(Homo sapiens (Human))
Janssen Pharmaceutica
US Patent
LigandPNGBDBM339048(US10201546, Example 12a)
Affinity DataKd:  290nM. Assay description: ThermoFluor is a fluorescence based assay that estimates ligand binding affinities by measuring the effect of a ligand on protein thermal stability (...
Ligand InfoPC cidPC sid
In DepthDetails US Patent
TargetNuclear receptor ROR-gamma(Homo sapiens (Human))
Janssen Pharmaceutica
US Patent
LigandPNGBDBM339048(US10201546, Example 12a)
Affinity DataIC50:  327nM. Assay description: Inverse agonist activity at GAL4-DNA binding domain-fused human RORgammat LBD expressed in pGL4.31 transfected HEK293T cells assessed as inhibition o...
Ligand InfoPC cidPC sid
In DepthDetails ArticlePubMed
TargetNuclear receptor ROR-gamma(Homo sapiens (Human))
Janssen Pharmaceutica
US Patent
LigandPNGBDBM339048(US10201546, Example 12a)
Affinity DataKd:  63nM. Assay description: Displacement of thermofluor from human recombinant N-terminal TEV cleavage site-fused-His-tagged RORgammat LBD expressed in Escherichia coli assessed...
Ligand InfoPC cidPC sid
In DepthDetails ArticlePubMed
TargetNuclear receptor ROR-gamma(Homo sapiens (Human))
Janssen Pharmaceutica
US Patent
LigandPNGBDBM339048(US10201546, Example 12a)
Affinity DataIC50:  1.10E+3nM. Assay description: For the RORγt construct used in the ThermoFluorŪ assay, numbering for the nucleotide sequences was based on the reference sequence for human ROR...
Ligand InfoPC cidPC sid
In DepthDetails US Patent