BDBM340651 US9771316, Example 53
SMILES NCCCCC(Oc1ccc(OC(F)(F)F)c(F)c1)c1cccs1
InChI Key InChIKey=DABWYOHGPQEMKY-UHFFFAOYSA-N
Data  2 IC50
  Tab Delimited (TSV)   2D SDfile   Computed 3D by Vconf -m prep SDfile
Find this compound or compounds like it in BindingDB:
Activity Spreadsheet -- Enzyme Inhibition Constant Data from BindingDB
Found 2 hits for monomerid = 340651
TargetLarge neutral amino acids transporter small subunit 2(Homo sapiens (Human))
Osaka University
US Patent
LigandPNGBDBM340651(US9771316, Example 53)
Affinity DataIC50:  2.58E+5nM
Ligand InfoPC cidPC sid
In DepthDetails US Patent
TargetLarge neutral amino acids transporter small subunit 1(Homo sapiens (Human))
Osaka University
US Patent
LigandPNGBDBM340651(US9771316, Example 53)
Affinity DataIC50:  1.46E+5nM. Assay description: Expression vector each expressing a gene was inserted using Lipofectamine 2000 (Invitrogen) to cultured cell line HEK293 cell derived from human fetu...
Ligand InfoPC cidPC sid
In DepthDetails US Patent