BDBM349513 US10207991, Ex. Cpd. No. 28::US10611728, Example Compound 28::US11691947, Example 28
SMILES CC(C)Oc1cc(CCC(C)(C)N2Cc3cccc(F)c3C2)ccc1O
InChI Key InChIKey=CZMKZNSLFDBBJT-UHFFFAOYSA-N
Data  9 KI  1 IC50  1 EC50
  Tab Delimited (TSV)   2D SDfile   Computed 3D by Vconf -m prep SDfile
Find this compound or compounds like it in BindingDB:
Activity Spreadsheet -- Enzyme Inhibition Constant Data from BindingDB
Found 11 hits for monomerid = 349513
TargetSigma intracellular receptor 2(Homo sapiens (Human))
Cognition Therapeutics
US Patent
LigandPNGBDBM349513(US10207991, Ex. Cpd. No. 28 | US10611728, Example ...)
Affinity DataKi:  11nM. Assay description: Radioligand binding assays for Sigma-1 receptors and Sigma-2 receptors were carried out by a commercial contract research organization. For Sigma-1 b...
Ligand InfoPC cidPC sid
In DepthDetails US Patent
TargetSigma intracellular receptor 2(Homo sapiens (Human))
Cognition Therapeutics
US Patent
LigandPNGBDBM349513(US10207991, Ex. Cpd. No. 28 | US10611728, Example ...)
Affinity DataKi:  11nM. Assay description: Binding affinity to Sigma 2-receptor (unknown origin)
Ligand InfoPC cidPC sid
In DepthDetails ArticlePubMed
TargetSigma intracellular receptor 2(Rattus norvegicus (Rat))
Cognition Therapeutics
US Patent
LigandPNGBDBM349513(US10207991, Ex. Cpd. No. 28 | US10611728, Example ...)
Affinity DataKi:  11nM. Assay description: The affinity of candidate sigma-2 ligand compounds at sigma-1 and sigma-2 receptors was also determined by displacement of different known labeled si...
Ligand InfoPC cidPC sid
In DepthDetails US Patent
TargetSigma intracellular receptor 2(Homo sapiens (Human))
Cognition Therapeutics
US Patent
LigandPNGBDBM349513(US10207991, Ex. Cpd. No. 28 | US10611728, Example ...)
Affinity DataKi:  11nM. Assay description: Radioligand binding assays for Sigma-1 receptors and Sigma-2 receptors were carried out by a commercial contract research organization. For Sigma-1 b...
Ligand InfoPC cidPC sid
In DepthDetails US Patent
TargetSigma intracellular receptor 2(Homo sapiens (Human))
Cognition Therapeutics
US Patent
LigandPNGBDBM349513(US10207991, Ex. Cpd. No. 28 | US10611728, Example ...)
Affinity DataKi:  11nM. Assay description: The affinity of candidate sigma-2 ligand compounds at sigma-1 and sigma-2 receptors was also determined by displacement of different known labeled si...
Ligand InfoPC cidPC sid
In DepthDetails US Patent
TargetSigma non-opioid intracellular receptor 1(Homo sapiens (Human))
Cognition Therapeutics
US Patent
LigandPNGBDBM349513(US10207991, Ex. Cpd. No. 28 | US10611728, Example ...)
Affinity DataKi:  120nM. Assay description: Radioligand binding assays for Sigma-1 receptors and Sigma-2 receptors were carried out by a commercial contract research organization. For Sigma-1 b...
Ligand InfoPC cidPC sid
In DepthDetails US Patent
TargetSigma non-opioid intracellular receptor 1(Cavia porcellus (Guinea pig))
Cognition Therapeutics
US Patent
LigandPNGBDBM349513(US10207991, Ex. Cpd. No. 28 | US10611728, Example ...)
Affinity DataKi:  120nM. Assay description: The affinity of candidate sigma-2 ligand compounds at sigma-1 and sigma-2 receptors was also determined by displacement of different known labeled si...
Ligand InfoPC cidPC sid
In DepthDetails US Patent
TargetSigma non-opioid intracellular receptor 1(Homo sapiens (Human))
Cognition Therapeutics
US Patent
LigandPNGBDBM349513(US10207991, Ex. Cpd. No. 28 | US10611728, Example ...)
Affinity DataKi:  120nM. Assay description: Radioligand binding assays for Sigma-1 receptors and Sigma-2 receptors were carried out by a commercial contract research organization. For Sigma-1 b...
Ligand InfoPC cidPC sid
In DepthDetails US Patent
TargetSigma non-opioid intracellular receptor 1(Homo sapiens (Human))
Cognition Therapeutics
US Patent
LigandPNGBDBM349513(US10207991, Ex. Cpd. No. 28 | US10611728, Example ...)
Affinity DataKi:  120nM. Assay description: The affinity of candidate sigma-2 ligand compounds at sigma-1 and sigma-2 receptors was also determined by displacement of different known labeled si...
Ligand InfoPC cidPC sid
In DepthDetails US Patent
TargetPotassium voltage-gated channel subfamily H member 2(Homo sapiens (Human))
Cognition Therapeutics
Curated by ChEMBL
LigandPNGBDBM349513(US10207991, Ex. Cpd. No. 28 | US10611728, Example ...)
Affinity DataEC50:  9.60E+3nM. Assay description: Inhibition of human ERG expressed in CHO cells measured by Patch-clamp assay
Ligand InfoPC cidPC sid
In DepthDetails ArticlePubMed
TargetPotassium voltage-gated channel subfamily H member 2(Homo sapiens (Human))
Cognition Therapeutics
Curated by ChEMBL
LigandPNGBDBM349513(US10207991, Ex. Cpd. No. 28 | US10611728, Example ...)
Affinity DataIC50:  9.60E+3nM. Assay description: Representative sigma-2 antagonists test compounds do not induce neuronal or glial toxicity with acute or chronic dosing in vitro. The sigma-2 recepto...
Ligand InfoPC cidPC sid
In DepthDetails US Patent