BDBM35359 2-(7-Ethyl-1,3-dimethyl-2,6-dioxo-2,3,6,7-tetrahydro-1H-purin-8-ylsulfanyl)-N-(6-methoxy-benzothiazol-2-yl)-acetamide::2-(7-ethyl-1,3-dimethyl-2,6-dioxopurin-8-yl)sulfanyl-N-(6-methoxy-1,3-benzothiazol-2-yl)acetamide::2-[(7-ethyl-1,3-dimethyl-2,6-dioxo-8-purinyl)thio]-N-(6-methoxy-1,3-benzothiazol-2-yl)acetamide::2-[(7-ethyl-2,6-diketo-1,3-dimethyl-purin-8-yl)thio]-N-(6-methoxy-1,3-benzothiazol-2-yl)acetamide::2-[7-ethyl-1,3-dimethyl-2,6-bis(oxidanylidene)purin-8-yl]sulfanyl-N-(6-methoxy-1,3-benzothiazol-2-yl)ethanamide::MLS000077340::SMR000002648::cid_655194
SMILES CCn1c(SCC(=O)Nc2nc3ccc(OC)cc3s2)nc2n(C)c(=O)n(C)c(=O)c12
InChI Key InChIKey=MARBKMRZGKOTQL-UHFFFAOYSA-N
Data  3 IC50
  Tab Delimited (TSV)   2D SDfile   Computed 3D by Vconf -m prep SDfile
Find this compound or compounds like it in BindingDB:
Activity Spreadsheet -- Enzyme Inhibition Constant Data from BindingDB
Found 3 hits for monomerid = 35359
TargetDual specificity protein phosphatase 1(Homo sapiens (Human))
University of Pittsburgh
Curated by PubChem BioAssay
LigandPNGBDBM35359(2-(7-Ethyl-1,3-dimethyl-2,6-dioxo-2,3,6,7-tetrahyd...)
Affinity DataIC50:  1.82E+4nMpH: 7.0 T: 2°C. Assay description: The MKP-1 HTS confirmation dose response assay has been developed to confirm actives identified in the MH-76391 In vitro HTS assay for MKP-1 inhibito...
In DepthDetails PCBioAssay
TargetM-phase inducer phosphatase 2(Homo sapiens (Human))
University of Pittsburgh
Curated by PubChem BioAssay
LigandPNGBDBM35359(2-(7-Ethyl-1,3-dimethyl-2,6-dioxo-2,3,6,7-tetrahyd...)
Affinity DataIC50: >5.00E+4nM. Assay description: The MKP-1 Dual Specificity Protein Tyrosine Phosphatase Probe Assessment Cdc25B Dose Response Selectivity Assay has been developed to evaluate the PT...
In DepthDetails PCBioAssay
TargetDual specificity protein phosphatase 6(Rattus norvegicus)
University of Pittsburgh
Curated by PubChem BioAssay
LigandPNGBDBM35359(2-(7-Ethyl-1,3-dimethyl-2,6-dioxo-2,3,6,7-tetrahyd...)
Affinity DataIC50: >5.00E+4nM. Assay description: The in vitro MKP-3 Phosphatase dose response hit/probe assessment assay has been developed and run at the University of Pittsburgh Molecular Screenin...
In DepthDetails PCBioAssay