BDBM356593 N-[3-(7-{1-[3-(Cyanomethyl)-1-(tetrahydrofuran-3-ylcarbonyl)azetidin-3-yl]-1H-pyrazol-4-yl}imidazo[1,2-b]pyridazin-3-yl)phenyl]-N′-(2,2,2-trifluoroethyl)urea::US10213427, Example 82
SMILES FC(F)(F)CNC(=O)Nc1cccc(c1)-c1cnc2cc(cnn12)C(\C=N)=C\NC1(CC#N)CN(C1)C(=O)C1CCOC1
InChI Key InChIKey=TXLVOMPNHBWCGJ-ZRRIYGARSA-N
Data  1 IC50
  Tab Delimited (TSV)   2D SDfile   Computed 3D by Vconf -m prep SDfile
Find this compound or compounds like it in BindingDB:
Activity Spreadsheet -- Enzyme Inhibition Constant Data from BindingDB
Found 1 hit for monomerid = 356593
TargetFibroblast growth factor receptor 3(Homo sapiens (Human))
Incyte
US Patent
LigandPNGBDBM356593(N-[3-(7-{1-[3-(Cyanomethyl)-1-(tetrahydrofuran-3-y...)
Affinity DataIC50: <10nM. Assay description: The inhibitor potency of compounds of the invention was measured in an enzyme assay that measures peptide phosphorylation using FRET measurements to ...
Ligand InfoPC cidPC sid
In DepthDetails US Patent